program: Gaussian 09
title: 000283495
version: EM64L-G09RevD.01
frameworkgroup: C1[X(C2H4BrCl2OP)]
method: RPBEPBE
basis: SDD
operation: Freq
keyword: #p
keyword: freq=noraman
keyword: PBEPBE/SDD
title: #p freq=noraman PBEPBE/SDD
converged: NO YES NO NO
title: Mulliken charges:
elementType: Br Cl Cl P O C C H H H H
charge: 0.044207 -0.152579 -0.165198 0.783094 -0.505347 -0.655013 -0.611428 0.324626 0.320683 0.311526 0.305429
chargesum: 0.00000
title: Mulliken charges with hydrogens summed into heavy atoms:
elementType: Br Cl Cl P O C C
charge: 0.044207 -0.152579 -0.165198 0.783094 -0.505347 -0.009704 0.005526
polarizability: 1.22239753e+02 1.75295665e+00 8.13538210e+01 2.14537791e+00 1.10439322e+00 6.78742352e+01
1716.lowfreq: -6.8223 -0.0009 0.0005 0.0007 3.4806 8.1436 49.8466 68.8799 76.8507
frequency: 49.8430 68.8764 76.8187 122.4576 154.8963 194.2093 231.8920 249.0134 278.5386 391.1214 441.9619 615.1315 678.1171 771.9583 939.5983 1040.3713 1042.7737 1124.6314 1236.6039 1271.6737 1293.6389 1414.3079 1459.1390 3041.4638 3070.0140 3123.7916 3158.8945
redmass: 9.9161 6.2705 3.0868 15.6632 22.7022 5.5652 4.4193 8.7587 18.3946 12.4839 21.6371 7.4507 5.3523 1.1365 1.4252 6.4975 5.2177 1.1110 1.1482 1.1601 1.2091 1.0862 1.0922 1.0599 1.0562 1.1053 1.1115
irintensity: 2.3973 2.6716 2.6383 2.3244 0.9400 7.2770 7.7773 8.1931 13.6969 95.9246 134.0320 4.6281 11.6313 18.8315 3.5427 36.8665 38.0040 21.3994 24.4429 0.2181 2.9099 9.9971 8.1843 4.8906 2.9346 1.1934 0.0786
temp: 298.150 k
press: 1.00000 atm
elementType: 35 17 17 15 8 6 6 1 1 1 1
symmnumber: 1
zpe: 164736.2 jmol-1
zpe.correction: 0.062745 hartree
zpe.thermalcorrener: 0.072466 hartree
zpe.thermalcorrenthalpy: 0.073410 hartree
zpe.thermalcorrgfe: 0.024375 hartree
zpe.sumelectzpe: -1428.087706 hartree
zpe.sumelectthermal: -1428.077985 hartree
zpe.sumelectthermalent: -1428.077040 hartree
zpe.sumelectthermalfe: -1428.126075 hartree
dipole: 2.4230 -0.5018 -0.9550
dipole: 2.6523
quadrupole: -84.1810 -73.6194 -77.9704
quadrupole: 0.5691 3.5288 0.3442
quadrupole: -5.5907 4.9709 0.6198 0.5691 3.5288 0.3442
hfenergy: -1428.1504507 hartree
pointgroup: C01 [X(C2H4Br1Cl2O1P1)]
dipole: -0.9569002 0.2593908 -0.3255216 debye
dipolederiv: -0.6244802 0.0110305 -0.0002097 0.013404 -0.0987034 0.0252957 -0.044225 0.0182248 -0.0857931 -0.6033841 -0.2116338 0.1156853 -0.3742919 -0.5704641 0.1655525 0.2138017 0.2106224 -0.3288147 -0.3343455 0.028195 0.0154723 0.1804594 -0.6580897 -0.2655801 0.0872917 -0.3182229 -0.4384772 1.3747661 0.1808817 -0.1582158 0.1590724 1.773843 0.1151893 -0.3147072 0.1399546 1.3970905 -0.5935053 0.0006812 0.0239503 0.0252032 -0.511529 0.0076763 0.0199676 -0.0174915 -0.6377992 0.1298259 -0.0817117 -0.0169767 -0.1032274 -0.2428341 0.0271571 0.0912158 0.0065064 -0.1778801 0.6201268 -0.1416465 0.1010224 0.1391803 0.1077555 -0.0563022 -0.037033 -0.0324924 0.1083416 0.0161085 0.054582 0.0148022 -0.0602965 0.0303643 -0.0301682 -0.0291331 -0.0141318 0.0955975 0.0225215 0.0119927 -0.0027102 -0.0083447 0.0881241 0.013886 0.0406084 0.0136231 0.0101469 -0.0101726 0.0445563 -0.0876845 0.0185059 0.0920744 0.0235477 -0.0018474 0.0297393 -0.0225752 0.0025389 0.1030727 -0.0051358 0.0103352 -0.010541 -0.026254 -0.0259395 -0.0363319 0.0801629 unknown
polarizability: 122.1623546|1.0616104|81.3627926|-3.4166308|0.4198734|67.9426619 unknown
InChI: InChI=1S/C2H4BrOP.2Cl/c3-1-2-5-4;;/h1-2H2;;
charge 0 multiplicity 1
11 atoms
Br -3.558544 0.291725 -0.263471
Cl 2.350575 1.575573 -0.752223
Cl 1.353045 -1.802692 -1.097945
P  1.05152 0.008886 0.230066
O  1.332501 -0.251486 1.767894
C  -0.690646 0.570774 -0.242341
C  -1.74138 -0.416814 0.266525
H  -0.81162 1.572059 0.207408
H  -0.697279 0.663658 -1.339677
H  -1.761008 -0.499081 1.363054
H  -1.660164 -1.408603 -0.201991
