program: Gaussian 09
title: 000283486
version: EM64L-G09RevD.01
frameworkgroup: C1[X(C15H14N2O4)]
method: RPBEPBE
basis: SDD
operation: Freq
keyword: #p
keyword: freq=noraman
keyword: PBEPBE/SDD
title: #p freq=noraman PBEPBE/SDD
converged: YES YES NO YES
title: Mulliken charges:
elementType: O O O O N N C C C C C C C C C C C C C C C H H H H H H H H H H H H H H
charge: -0.259286 -0.255817 -0.308037 -0.303581 -0.180542 0.027641 0.287310 -0.473091 -0.406967 -0.181651 -0.452582 0.514505 -0.037515 -0.538495 -0.476774 0.303368 0.180198 0.211292 -0.202977 -0.210906 -0.675149 0.255418 0.255405 0.257813 0.257825 0.259364 0.260877 0.290117 0.243214 0.243198 0.224588 0.224578 0.210187 0.228238 0.228236
chargesum: 0.00000
title: Mulliken charges with hydrogens summed into heavy atoms:
elementType: O O O O N N C C C C C C C C C C C C C C C
charge: -0.259286 -0.255817 -0.308037 -0.303581 -0.180542 0.027641 0.287310 0.037732 0.108671 -0.181651 -0.193218 0.514505 -0.037515 -0.277618 -0.186658 0.303368 0.180198 0.211292 0.283435 0.238260 -0.008489
polarizability: 3.45294166e+02 -1.09210381e+01 1.75332371e+02 3.87439553e-02 8.55660513e-03 9.33661123e+01
1716.lowfreq: -26.9796 -11.6834 -3.6961 -0.0009 0.0004 0.0007 3.5349 19.6732 27.2845
frequency: -26.4211 19.4733 26.9725 62.3353 72.0091 84.6545 116.6239 139.3148 157.7678 204.2708 206.3270 232.6383 238.1776 242.7130 246.8113 323.2579 329.4403 352.3158 354.2884 402.7837 416.5617 448.4934 480.7465 547.3729 589.0081 605.3503 627.9700 683.6032 690.9234 697.8895 699.8314 727.8588 745.0899 765.0675 778.2245 780.3222 800.5128 816.0009 849.7288 853.1563 857.0014 870.4431 881.9061 913.2252 975.7212 991.3815 1016.0736 1017.0562 1033.6155 1059.8143 1065.3394 1111.4798 1120.1018 1121.9907 1137.9466 1154.4443 1158.2829 1171.5613 1174.7740 1213.9613 1222.0721 1243.1616 1247.4362 1272.0048 1285.9973 1314.9228 1337.9661 1363.8551 1377.4292 1389.8508 1401.2400 1408.6031 1450.0977 1461.9425 1461.9617 1475.4983 1477.5129 1483.5119 1484.8063 1490.4810 1494.3430 1606.0259 1627.8318 1641.8261 1646.4891 2974.1642 2991.3543 2994.3099 3007.7595 3014.9078 3020.0459 3037.2065 3065.3629 3091.1969 3099.6535 3105.6524 3131.3580 3166.4530 3196.7031
redmass: 2.2402 4.0989 2.5689 4.4153 5.0305 6.1944 3.0453 4.9875 5.6050 3.8041 3.9913 3.3061 7.6019 5.5457 1.2736 4.1352 6.3284 3.9183 5.1532 3.5385 5.9438 5.9865 3.8049 5.1211 7.0879 6.8325 4.2714 9.7386 5.4331 10.6828 8.2717 6.2193 7.5166 6.2409 4.9613 3.0778 1.0951 4.6649 1.3743 4.1019 8.5199 2.9857 1.5665 1.4970 5.4254 1.6463 1.8857 2.4629 5.1663 6.1890 1.4545 2.2093 1.0369 3.6781 1.4541 2.2369 1.0986 1.0725 3.3319 1.6429 2.8649 2.3226 1.1348 9.1089 1.8213 1.7266 1.7573 1.2842 2.9374 1.8717 1.7148 5.0549 5.6460 5.2175 1.0408 1.1074 1.0805 1.3172 1.1855 1.1129 2.5364 9.8629 8.0305 8.8688 10.8183 1.0584 1.0588 1.0358 1.0580 1.1039 1.0535 1.1043 1.1067 1.0985 1.1188 1.1025 1.0929 1.0932 1.0940
irintensity: 15.6033 0.0004 0.1070 0.5851 2.4409 0.0109 9.3014 0.0355 0.8253 0.1137 1.5093 9.9837 0.1939 13.0166 0.3275 1.2440 4.0480 6.1697 1.4505 2.0073 13.6430 0.5004 3.3801 12.0134 4.2752 0.1322 0.1414 0.1555 0.0661 20.8783 4.1245 4.5831 1.8484 3.2715 7.2449 0.7000 3.1079 8.9311 10.4995 1.8474 34.9664 39.2246 21.5839 46.8161 171.9390 2.9681 0.6914 4.4529 6.0568 413.8339 4.3230 3.3854 0.0004 2.7951 4.6837 57.5988 0.8531 0.1451 78.1370 13.4839 3.5720 50.4729 0.0193 418.4958 86.6025 12.5898 132.2679 0.2256 4.7794 222.9661 57.3055 15.2880 148.5385 89.4272 12.1729 46.8120 2.5345 74.1155 20.6224 15.7097 19.7119 1.5884 89.3674 85.9275 356.0988 29.7066 12.3051 24.1332 32.9052 13.5751 140.6173 14.7561 9.8075 37.2260 27.3206 48.2244 8.6958 4.6473 2.4589
temp: 298.150 k
press: 1.00000 atm
elementType: 8 8 8 8 7 7 6 6 6 6 6 6 6 6 6 6 6 6 6 6 6 1 1 1 1 1 1 1 1 1 1 1 1 1 1
symmnumber: 1
zpe: 699965.0 jmol-1
zpe.correction: 0.266603 hartree
zpe.thermalcorrener: 0.283984 hartree
zpe.thermalcorrenthalpy: 0.284928 hartree
zpe.thermalcorrgfe: 0.219513 hartree
zpe.sumelectzpe: -988.886329 hartree
zpe.sumelectthermal: -988.868948 hartree
zpe.sumelectthermalent: -988.868004 hartree
zpe.sumelectthermalfe: -988.933419 hartree
dipole: 2.8192 -0.1155 0.0017
dipole: 2.8216
quadrupole: -98.8003 -124.1953 -121.0016
quadrupole: 12.7446 0.0072 -0.0010
quadrupole: 15.8654 -9.5296 -6.3359 12.7446 0.0072 -0.0010
hfenergy: -989.1529317 hartree
pointgroup: C01 [X(C15H14N2O4)]
dipole: -1.1095387 -0.0354225 -0.0006733 debye
polarizability: 345.4777444|9.3826509|175.1487927|0.038665|-0.0089065|93.3661123 unknown
InChI: InChI=1S/C15H14N2O4/c1-2-19-15(18)17-6-10-3-9-4-13-14(21-8-20-13)5-11(9)16-12(10)7-17/h3-5H,2,6-8H2,1H3
charge 0 multiplicity 1
35 atoms
O  -5.571177 0.810262 -0.001163
O  -5.251928 -1.567901 -0.000599
O  4.864185 -0.644942 0.000604
O  4.858456 1.719656 0.000305
N  2.875431 0.480682 0.000782
N  -0.350631 -1.189499 0.000361
C  0.615744 1.076081 0.000134
C  2.000695 1.683819 0.000335
C  2.144572 -0.810304 0.000857
C  0.69814 -0.354702 0.000433
C  -0.639809 1.677745 -0.000272
C  -1.804663 0.841718 -0.000371
C  -1.612057 -0.605878 -0.000037
C  -3.134123 1.393668 -0.000785
C  -2.746775 -1.489626 -0.000115
C  4.238955 0.619282 0.000997
C  -4.192145 0.5053 -0.000853
C  -4.001468 -0.9113 -0.000521
C  -6.280843 -0.496204 -0.001402
C  6.354237 -0.603304 -0.000036
C  6.830057 -2.053027 -0.000353
H  2.200441 2.31235 -0.889429
H  2.200032 2.312686 0.889955
H  2.390257 -1.418894 0.89119
H  2.390666 -1.41925 -0.889118
H  -0.75648 2.767656 -0.000514
H  -3.29399 2.475405 -0.001029
H  -2.58304 -2.568452 0.000151
H  -6.884301 -0.576732 0.918528
H  -6.883171 -0.577016 -0.922061
H  6.691447 -0.048635 -0.894478
H  6.692197 -0.048775 0.894209
H  7.935027 -2.083955 -0.000828
H  6.467464 -2.586926 0.894749
H  6.466698 -2.586787 -0.895226
