program: Gaussian 09
title: 000286381
version: EM64L-G09RevD.01
frameworkgroup: C1[X(C19H13NO)]
method: RPBEPBE
basis: SDD
operation: Freq
keyword: #p
keyword: freq=noraman
keyword: PBEPBE/SDD
title: #p freq=noraman PBEPBE/SDD
converged: YES YES NO NO
title: Mulliken charges:
elementType: O N C C C C C C C C C C C C C C C C C C C H H H H H H H H H H H H H
charge: -0.254577 -0.468836 -0.264927 0.295417 0.398631 0.394381 0.349144 -0.409444 -0.421591 -0.425126 -0.370599 -0.387046 -0.424830 -0.249215 0.130139 0.246657 -0.341965 -0.358408 -0.222588 -0.236532 -0.225914 0.255144 0.252547 0.248648 0.197698 0.306943 0.249841 0.222517 0.318333 0.274782 0.218790 0.234972 0.231939 0.235076
chargesum: 0.00000
title: Mulliken charges with hydrogens summed into heavy atoms:
elementType: O N C C C C C C C C C C C C C C C C C C C
charge: -0.254577 -0.150504 -0.264927 0.295417 0.398631 0.394381 0.349144 -0.154300 -0.169044 -0.176478 -0.172901 -0.080103 -0.174989 -0.026698 0.130139 0.246657 -0.067183 -0.139618 0.012384 -0.004593 0.009162
polarizability: 3.86559915e+02 -7.49940184e-01 2.45330834e+02 -7.36995838e+00 3.98294008e+00 8.74797103e+01
1716.lowfreq: -5.7623 -3.1710 -0.0006 -0.0002 0.0002 4.3889 26.1555 32.0841 56.3512
frequency: 26.0939 32.0597 56.3441 78.3472 123.1655 164.0665 176.3152 205.5413 214.2277 225.3643 300.2239 309.9070 400.0044 404.5031 436.5937 450.2423 456.0419 460.4049 495.0080 519.4070 553.4323 582.7180 613.4205 617.7199 624.1584 661.7953 668.6787 683.4097 695.5186 701.6036 705.0486 748.3081 768.2721 771.0865 790.9522 822.1246 829.6050 852.9610 868.2794 877.6447 905.6379 925.6004 930.3292 938.0906 971.1483 983.2180 986.2249 989.2531 1006.1434 1021.2420 1027.1505 1047.3574 1079.7880 1086.9501 1095.2928 1124.6345 1174.7009 1179.7208 1191.3389 1204.6698 1207.3074 1241.0550 1255.6147 1281.3353 1317.1662 1320.1588 1360.1544 1367.0253 1384.5259 1421.9105 1434.0430 1449.9383 1464.6142 1477.6762 1483.1574 1493.6761 1519.2395 1576.6627 1598.4785 1609.6964 1610.6761 1622.2968 1628.5533 3102.7959 3112.9610 3132.5875 3133.3759 3138.6689 3146.2495 3154.8010 3159.4077 3170.9264 3176.0006 3192.7344 3202.6035 3543.7203
redmass: 4.2742 5.1793 5.6710 6.4902 4.4136 5.1462 4.3337 4.5148 5.8728 4.7630 5.3290 5.6225 3.4959 3.9199 4.3779 3.6798 4.3413 3.8055 5.5570 6.2786 6.0114 3.2604 5.1183 2.9654 2.7345 2.0716 5.1556 4.4165 3.1370 6.3096 1.6312 1.6175 1.4303 5.2665 2.4697 4.7674 3.6226 1.3065 5.3145 1.3852 1.4017 1.3736 2.1757 2.3206 1.3814 1.4659 1.3667 4.8165 1.3453 2.7894 2.4844 1.8877 1.8421 1.2783 2.2315 2.4951 1.0598 1.5360 1.1215 1.4975 1.5284 3.1418 2.3388 2.2508 1.5652 1.9212 3.1852 2.7979 8.6846 3.1062 2.3050 2.5295 5.6533 2.4068 4.6525 4.3864 2.4551 5.4906 7.2974 5.9436 5.6839 7.0016 6.6287 1.0876 1.0881 1.0901 1.0867 1.0917 1.0917 1.0974 1.0957 1.1007 1.0886 1.0930 1.1048 1.0752
irintensity: 0.3929 0.4311 1.1486 2.5096 1.0739 3.0778 10.3293 1.2437 0.9409 3.8778 3.2931 4.9009 0.2922 0.3266 3.2768 4.2968 1.2263 0.7453 2.9856 9.4048 2.1230 0.0466 3.1838 12.1603 17.4500 5.3487 2.4034 19.1915 6.5002 7.4793 87.5745 106.5598 7.8163 3.9405 17.5103 9.6243 24.5440 0.8796 21.5870 70.1794 10.8258 0.7758 6.0324 4.3548 1.4695 2.8263 2.0706 0.7858 2.0424 7.1059 6.6044 1.2097 45.0080 18.9027 2.5230 0.6369 1.8989 2.2935 14.1640 0.4501 11.3042 28.0365 128.3694 81.1580 4.7177 62.9354 96.7998 63.0201 1.5453 0.4053 5.0843 226.4412 195.8835 6.3738 7.5903 66.2768 509.5798 52.1506 30.3768 11.1529 46.5290 5.0902 10.1748 16.6504 15.5620 14.8306 0.4603 15.7682 19.5044 31.1721 15.4657 24.9525 1.3833 3.7045 24.0195 8.8454
temp: 298.150 k
press: 1.00000 atm
elementType: 8 7 6 6 6 6 6 6 6 6 6 6 6 6 6 6 6 6 6 6 6 1 1 1 1 1 1 1 1 1 1 1 1 1
symmnumber: 1
zpe: 689831.9 jmol-1
zpe.correction: 0.262743 hartree
zpe.thermalcorrener: 0.278411 hartree
zpe.thermalcorrenthalpy: 0.279355 hartree
zpe.thermalcorrgfe: 0.218335 hartree
zpe.sumelectzpe: -860.411264 hartree
zpe.sumelectthermal: -860.395596 hartree
zpe.sumelectthermalent: -860.394652 hartree
zpe.sumelectthermalfe: -860.455673 hartree
dipole: 1.3264 3.7306 -0.1254
dipole: 3.9613
quadrupole: -99.0918 -111.8363 -128.1853
quadrupole: 7.3433 -1.7968 1.7454
quadrupole: 13.9460 1.2014 -15.1475 7.3433 -1.7968 1.7454
hfenergy: -860.6740073 hartree
pointgroup: C01 [X(C19H13N1O1)]
dipole: -0.4985882 1.4759175 0.0447984 debye
polarizability: 386.4208264|-1.5271768|245.2932783|-9.6650108|-4.7432701|87.6563544 unknown
InChI: InChI=1S/C19H13NO/c21-19(15-5-2-1-3-6-15)20-17-12-11-14-10-9-13-7-4-8-16(17)18(13)14/h1-12,20H
charge 0 multiplicity 1
34 atoms
O  -2.020027 -2.244957 0.031906
N  -0.876764 -0.18978 0.031093
C  2.834522 -0.005178 -0.007163
C  1.497966 0.441956 0.050668
C  3.247019 -1.369908 -0.113896
C  3.986673 0.847887 0.035274
C  0.478176 -0.598245 -0.009682
C  4.72491 -1.358151 -0.139203
C  5.166234 -0.041907 -0.051632
C  2.244272 -2.346975 -0.163522
C  1.316579 1.865482 0.162136
C  0.867724 -1.954622 -0.109381
C  3.783097 2.229301 0.143078
C  2.434027 2.718959 0.206389
C  -2.036052 -0.975874 0.015422
C  -3.328647 -0.200261 0.002599
C  -4.485145 -0.860309 0.492448
C  -3.448058 1.122127 -0.503955
C  -5.731744 -0.202661 0.504984
C  -4.698556 1.777965 -0.495622
C  -5.841523 1.121101 0.016157
H  5.358188 -2.244561 -0.214672
H  6.205842 0.291519 -0.046152
H  2.480755 -3.414172 -0.241971
H  0.319585 2.321864 0.221628
H  0.084816 -2.714061 -0.139981
H  4.618014 2.937952 0.181522
H  2.270601 3.799101 0.293612
H  -1.028614 0.816045 0.120349
H  -4.379821 -1.889577 0.850241
H  -2.588323 1.634014 -0.955079
H  -6.616742 -0.719234 0.891772
H  -4.784063 2.792603 -0.899489
H  -6.81062 1.631955 0.022526
