program: Gaussian 09
title: 000286375
version: EM64L-G09RevD.01
frameworkgroup: C1[X(C14H12N2O3)]
method: RPBEPBE
basis: SDD
operation: Freq
keyword: #p
keyword: freq=noraman
keyword: PBEPBE/SDD
title: #p freq=noraman PBEPBE/SDD
converged: YES YES NO NO
title: Mulliken charges:
elementType: O O O N N C C C C C C C C C C C C C C H H H H H H H H H H H H
charge: -0.207353 -0.206408 -0.418017 0.011753 -0.088991 -0.161000 -0.549710 0.306732 -0.550478 0.298534 0.244248 0.316853 -0.442182 -0.427798 0.264278 -0.393506 -0.390869 0.057406 -0.759728 0.242269 0.240367 0.245026 0.242570 0.247724 0.253780 0.237743 0.271771 0.274109 0.246004 0.224511 0.370364
chargesum: 0.00000
title: Mulliken charges with hydrogens summed into heavy atoms:
elementType: O O O N N C C C C C C C C C C C C C C
charge: -0.207353 -0.206408 -0.047653 0.011753 -0.088991 -0.161000 -0.067074 0.306732 -0.062882 0.298534 0.244248 0.316853 -0.194458 -0.174018 0.264278 -0.155763 -0.119099 0.057406 -0.015104
polarizability: 2.57006136e+02 7.05168099e+00 2.09068909e+02 -8.33782826e-01 1.49160226e+01 1.00517233e+02
1716.lowfreq: -10.8642 -8.1594 0.0003 0.0006 0.0008 2.5221 46.1403 48.8778 73.2336
frequency: 46.0089 48.8726 73.2010 83.8548 92.6371 109.4425 127.9437 159.9670 194.1926 217.9226 260.6450 264.7168 300.0988 319.5713 347.9401 360.7295 407.8194 422.3993 461.9265 479.0941 489.5392 544.1391 548.7882 558.3118 569.8862 611.8335 648.9799 658.9890 678.4435 706.0408 741.6515 748.9649 763.9281 822.3362 827.1778 838.0391 860.8662 872.9143 910.9461 954.1384 962.8989 964.9131 998.2175 1010.5534 1028.0398 1049.2312 1082.8418 1126.0413 1129.5242 1145.7604 1196.6598 1202.4097 1218.6082 1221.4836 1221.9630 1233.1094 1257.1477 1296.4683 1328.2843 1345.8205 1361.5985 1376.4715 1383.6954 1400.5044 1439.3893 1448.0961 1451.3849 1457.5899 1464.4318 1477.2110 1511.8085 1575.2012 1587.8544 1601.6394 1611.2714 2992.3320 2994.0833 3005.4621 3038.1603 3058.3865 3073.7640 3118.7036 3132.5155 3148.4526 3153.6952 3173.5555 3565.8601
redmass: 3.6246 5.9495 4.2536 2.3080 3.0498 1.8700 2.5200 4.5673 6.4194 5.2299 4.7927 4.0361 4.8977 7.4117 7.7573 4.1260 1.8261 3.3602 3.4615 2.5114 4.2536 6.3782 4.4167 3.6395 6.1598 4.9014 3.5300 4.6938 5.7085 6.2647 4.1278 2.7389 6.8232 2.2126 5.5564 1.3995 1.4425 5.8995 5.5709 1.4092 1.4432 2.8974 1.9542 1.9667 1.5745 2.6779 3.8723 2.6301 2.0981 1.1784 1.6719 1.1101 3.0518 2.1175 1.8237 2.0325 1.4470 2.0497 1.9530 2.7193 6.4350 3.5872 1.3468 5.0295 1.4983 2.3446 1.0680 1.3587 1.1173 2.1649 4.6782 6.6510 7.0727 7.3944 8.6689 1.0366 1.0595 1.0625 1.1019 1.1019 1.0959 1.1007 1.0878 1.0902 1.0960 1.0945 1.0674
irintensity: 1.6124 1.4776 1.7405 0.5373 0.0909 1.0231 0.8871 2.8852 2.9943 1.9179 3.8192 2.0195 0.6224 1.4799 1.1768 4.0904 74.0909 13.1586 2.5460 36.8745 5.0211 1.6409 10.6926 19.5124 0.2878 4.3906 3.6167 16.6422 7.0640 19.3681 1.9381 3.6723 8.4601 12.1325 3.1887 5.0178 100.7482 52.4867 23.9642 0.7163 3.0508 5.2946 44.3900 0.1061 3.4753 1.2893 3.0373 1.9620 15.8047 0.4890 7.4805 0.0214 181.3424 78.6080 83.5035 4.4158 84.4338 3.2184 5.5756 15.7806 78.5971 45.3281 26.8689 18.8578 13.9060 6.2707 8.8893 4.6626 31.7667 4.6235 25.4689 2.0125 5.7665 53.0681 15.4446 7.9040 16.9359 34.5915 1.1314 23.4555 6.4545 12.4518 9.9006 10.1783 18.0626 1.4324 65.1351
temp: 298.150 k
press: 1.00000 atm
elementType: 8 8 8 7 7 6 6 6 6 6 6 6 6 6 6 6 6 6 6 1 1 1 1 1 1 1 1 1 1 1 1
symmnumber: 1
zpe: 608647.9 jmol-1
zpe.correction: 0.231822 hartree
zpe.thermalcorrener: 0.248192 hartree
zpe.thermalcorrenthalpy: 0.249136 hartree
zpe.thermalcorrgfe: 0.187651 hartree
zpe.sumelectzpe: -874.403183 hartree
zpe.sumelectthermal: -874.386813 hartree
zpe.sumelectthermalent: -874.385869 hartree
zpe.sumelectthermalfe: -874.447354 hartree
dipole: -5.8883 -2.3961 0.7268
dipole: 6.3986
quadrupole: -97.3888 -102.0721 -111.1942
quadrupole: -6.8990 3.6932 3.2860
quadrupole: 6.1629 1.4796 -7.6425 -6.8990 3.6932 3.2860
hfenergy: -874.6350052 hartree
pointgroup: C01 [X(C14H12N2O3)]
dipole: -2.286887 -1.0305465 0.2129672 debye
polarizability: 256.4337306|9.4504809|202.1562257|-5.5334083|30.6735657|108.0023212 unknown
InChI: InChI=1S/C14H12N2O3/c1-8(15-17)11-6-4-9-2-3-10-5-7-12(16(18)19)14(11)13(9)10/h4-7,17H,2-3H2,1H3
charge 0 multiplicity 1
31 atoms
O  2.033896 2.974381 0.358432
O  2.138626 1.446801 -1.330486
O  4.029317 -0.599889 0.906234
N  1.544634 1.988217 -0.318333
N  2.565928 -0.499448 0.861487
C  -1.606637 -0.09935 -0.014305
C  -3.753005 -1.198591 -0.049738
C  -2.247089 -1.355202 -0.233157
C  -3.952058 0.305613 0.366941
C  -2.554672 0.912475 0.329293
C  -0.191585 0.111598 -0.122338
C  0.613621 -1.06909 -0.351754
C  -1.460976 -2.457527 -0.568337
C  -2.107959 2.212041 0.575212
C  0.198324 1.493426 0.036144
C  -0.042309 -2.294468 -0.603862
C  -0.71947 2.491217 0.406199
C  2.100409 -1.092721 -0.22348
C  2.971265 -1.770963 -1.25461
H  -4.293372 -1.429036 -0.986861
H  -4.144097 -1.889569 0.719481
H  -4.389432 0.387421 1.379585
H  -4.641309 0.833395 -0.317634
H  -1.898856 -3.441593 -0.765436
H  -2.79289 3.018024 0.856192
H  0.576312 -3.180462 -0.786717
H  -0.342297 3.510756 0.529922
H  3.586682 -0.999016 -1.753683
H  3.674428 -2.478706 -0.780843
H  2.369521 -2.286653 -2.018102
H  4.244951 -0.087682 1.727454
