program: Gaussian 09
title: 000283468
version: EM64L-G09RevD.01
frameworkgroup: C1[X(C11H14BrN3O4)]
method: RPBEPBE
basis: SDD
operation: Freq
keyword: #p
keyword: freq=noraman
keyword: PBEPBE/SDD
title: #p freq=noraman PBEPBE/SDD
converged: YES YES NO NO
title: Mulliken charges:
elementType: Br O O O O N N N C C C C C C C C C C C H H H H H H H H H H H H H H
charge: 0.052775 -0.272208 -0.272909 -0.284590 -0.249422 -0.430466 -0.078716 -0.623649 -0.166300 -0.124230 -0.162996 0.340993 -0.353554 0.525425 -0.687739 -0.692833 -0.519690 0.129636 0.150405 0.271364 0.251122 0.284042 0.259191 0.213906 0.221130 0.219659 0.269737 0.242529 0.220182 0.221743 0.361695 0.350266 0.333502
chargesum: 0.00000
title: Mulliken charges with hydrogens summed into heavy atoms:
elementType: Br O O O O N N N C C C C C C C C C C C
charge: 0.052775 -0.272208 -0.272909 -0.284590 -0.249422 -0.068771 -0.078716 0.060119 0.105064 0.126891 0.121046 0.340993 0.119543 0.525425 0.022786 -0.008380 -0.519690 0.129636 0.150405
polarizability: 2.12367780e+02 8.49533243e+00 1.71648914e+02 9.30437196e+00 -1.13209805e-01 1.03183005e+02
1716.lowfreq: -14.0857 -0.7550 -0.0006 -0.0004 -0.0002 6.9286 23.7922 32.4457 50.1924
frequency: 22.3236 32.2923 50.1869 59.2212 72.1041 103.8609 116.2781 131.4742 161.7900 165.8358 220.1393 248.3633 252.0160 269.0095 273.4080 306.7460 314.8595 341.5980 376.3015 383.0453 407.2320 482.6177 488.6638 537.1609 551.3624 581.3330 604.0696 621.1747 635.6689 645.0777 665.6090 698.5365 715.7899 729.1212 746.9562 772.2839 801.1490 826.6856 849.3216 855.6250 883.1488 924.1467 936.6888 962.8271 977.6959 986.5109 1003.0154 1019.6872 1049.0993 1066.0143 1066.5236 1080.5690 1138.3824 1139.8182 1180.8646 1188.5667 1204.8606 1231.0480 1258.2534 1259.2617 1262.4914 1268.6703 1279.4989 1316.0379 1330.8016 1333.5974 1352.6575 1381.2428 1395.0460 1413.8305 1452.2434 1454.4283 1457.3142 1458.3640 1474.4967 1484.1077 1522.6659 1576.6894 1635.2307 2969.4864 2991.9889 3007.6857 3038.7964 3060.5356 3090.4017 3095.3627 3099.5739 3110.3962 3111.2439 3121.5333 3510.3948 3582.3332 3675.3617
redmass: 4.7654 5.9278 8.0005 6.9812 4.6045 3.7598 9.0583 6.6409 1.2240 3.7720 3.3799 6.1469 1.1212 4.6590 5.6553 7.5653 4.3861 2.8184 2.9197 4.0510 3.0686 4.0401 9.0866 1.3853 4.4914 5.1928 1.2245 4.7691 4.1653 3.7018 6.0705 5.0069 4.9768 6.5190 1.2215 5.9332 5.6715 3.9438 5.7815 3.7323 2.9916 1.6527 2.9576 2.2481 4.8558 1.3235 5.5690 3.7461 2.6324 2.0022 4.1912 3.0948 2.7669 2.2190 1.3825 1.4251 2.6032 1.4561 1.4371 3.1460 2.7563 1.2749 4.6140 1.2292 1.4057 1.2864 2.3687 1.2825 1.2118 5.7638 1.0516 1.0927 1.1926 3.8084 1.0651 1.0484 5.5338 1.3884 4.8530 1.0682 1.0353 1.0354 1.0854 1.0880 1.0888 1.0998 1.1013 1.0994 1.0973 1.1010 1.0450 1.0819 1.1045
irintensity: 0.5227 0.0072 8.4750 1.6072 0.2444 3.8077 0.3499 10.8933 0.3421 3.5833 4.5467 6.7093 0.4930 0.6133 2.7980 13.8179 5.7982 3.0933 0.3108 3.3377 4.7497 13.3056 8.9672 120.2793 1.2855 2.2128 145.7576 5.0505 2.9243 13.8004 11.8279 28.1675 15.7852 7.6611 103.6504 1.1104 48.4027 41.1261 2.5223 11.9864 7.0341 3.7430 34.3193 9.1589 48.2139 1.9598 117.2491 86.0272 37.0566 3.7498 10.3844 45.0810 8.3465 23.4991 17.8482 35.8862 86.5655 13.9906 1.8860 112.1061 40.9305 1.4898 84.5717 2.8556 11.7641 3.8342 2.6188 41.3990 35.2445 19.3356 7.2962 1.5681 16.8731 82.0524 0.8519 12.1172 11.4544 196.8029 263.6552 48.6417 15.7237 14.0221 4.1946 21.6824 15.7337 7.2449 6.3596 15.5381 20.2315 19.1970 41.3242 112.0614 55.7488
temp: 298.150 k
press: 1.00000 atm
elementType: 35 8 8 8 8 7 7 7 6 6 6 6 6 6 6 6 6 6 6 1 1 1 1 1 1 1 1 1 1 1 1 1 1
symmnumber: 1
zpe: 657873.0 jmol-1
zpe.correction: 0.250571 hartree
zpe.thermalcorrener: 0.268781 hartree
zpe.thermalcorrenthalpy: 0.269725 hartree
zpe.thermalcorrgfe: 0.202235 hartree
zpe.sumelectzpe: -904.725207 hartree
zpe.sumelectthermal: -904.706997 hartree
zpe.sumelectthermalent: -904.706052 hartree
zpe.sumelectthermalfe: -904.773542 hartree
dipole: -2.8324 4.4584 0.1623
dipole: 5.2845
quadrupole: -120.3426 -116.4913 -119.4490
quadrupole: 15.6118 1.3733 2.4849
quadrupole: -1.5816 2.2697 -0.6881 15.6118 1.3733 2.4849
hfenergy: -904.9757775 hartree
pointgroup: C01 [X(C11H14Br1N3O4)]
dipole: -1.0742512 -1.5514203 0.872761 debye
polarizability: 210.6460642|-15.0926721|156.2374461|-11.8779048|-27.6769754|120.3161887 unknown
InChI: InChI=1S/C11H14BrN3O4/c1-11(2)18-4-3-17-9(8(4)19-11)6-5(12)7(10(13)16)15-14-6/h4,8-9,14H,3,13H2,1-2H3
charge 0 multiplicity 1
33 atoms
Br 1.698567 2.166791 -1.417837
O  -2.458526 1.474086 -0.532999
O  -3.688925 -0.515955 -0.808202
O  -1.190163 -1.029264 1.208051
O  4.786471 0.91673 -1.523922
N  1.473011 -1.229785 0.845528
N  2.813744 -1.341629 0.556252
N  5.368828 -1.011004 -0.341391
C  -1.459227 0.422747 -0.731181
C  -2.277914 -0.898542 -0.955867
C  -0.592819 0.158248 0.537486
C  -3.772549 0.846894 -0.209533
C  -1.776912 -1.870096 0.128036
C  0.867709 -0.13154 0.261958
C  -3.981835 0.761611 1.309444
C  -4.857562 1.626286 -0.945981
C  1.895546 0.520955 -0.446551
C  3.082179 -0.257035 -0.247572
C  4.471018 -0.048914 -0.767191
H  -0.846465 0.723036 -1.593492
H  -2.165679 -1.315901 -1.969853
H  -0.699732 1.006872 1.236048
H  -2.593285 -2.454919 0.577338
H  -1.002492 -2.548599 -0.286264
H  -3.986035 1.776726 1.743317
H  -4.952805 0.282351 1.524754
H  -3.182138 0.169438 1.785478
H  -4.635989 1.647097 -2.024626
H  -5.839093 1.148048 -0.78834
H  -4.901706 2.661491 -0.567411
H  1.003544 -1.894834 1.461065
H  5.059081 -1.767604 0.269411
H  6.337653 -0.945988 -0.647451
