program: Gaussian 09
title: 000283455
version: EM64L-G09RevD.01
frameworkgroup: C1[X(C11H16O7)]
method: RPBEPBE
basis: SDD
operation: Freq
keyword: #pfreq=noraman
keyword: PBEPBE/SDD
title: #p freq=noraman PBEPBE/SDD
converged: YES YES NO NO
title: Mulliken charges:
elementType: O O O O O O O C C C C C C C C C C C H H H H H H H H H H H H H H H H
charge: -0.241224 -0.259908 -0.266996 -0.258669 -0.250188 -0.243108 -0.247052 -0.067063 -0.025849 -0.518737 -0.013920 -0.349835 0.300428 0.325290 0.304644 -0.760249 -0.756250 -0.751874 0.262764 0.265038 0.236888 0.269754 0.287971 0.241730 0.267054 0.256198 0.250801 0.250260 0.246134 0.251465 0.247731 0.243255 0.246761 0.256755
chargesum: 0.00000
title: Mulliken charges with hydrogens summed into heavy atoms:
elementType: O O O O O O O C C C C C C C C C C C
charge: -0.241224 -0.259908 -0.266996 -0.258669 -0.250188 -0.243108 -0.247052 0.195701 0.239189 -0.012095 0.274050 0.158949 0.300428 0.325290 0.304644 -0.002990 -0.010919 -0.005103
polarizability: 1.49841405e+02 6.42994578e+00 1.50009626e+02 -7.89324744e+00 -3.80128012e+00 1.20426111e+02
1716.lowfreq: -12.3342 -6.8521 -5.3024 -0.0004 0.0004 0.0006 3.7625 13.4789 27.4356
frequency: -11.1312 12.9799 27.4026 31.8987 40.8600 46.4517 57.9776 67.3492 73.8637 78.6577 87.9133 116.9799 148.8118 184.9073 197.1115 255.0865 272.8588 299.3782 306.6510 359.1531 395.7078 406.1141 462.3583 470.1705 514.9858 559.1008 561.6174 576.5044 595.9044 605.3385 626.1961 686.2007 717.7780 780.5064 791.8233 805.9338 817.3144 874.3943 889.7036 945.1300 960.5477 987.0479 994.8154 998.8709 1005.0393 1024.3841 1029.3947 1042.1679 1043.9550 1047.3536 1056.9865 1087.2667 1114.4349 1172.6093 1190.3317 1195.2264 1203.2682 1225.2883 1247.3139 1255.2418 1295.5357 1309.8148 1314.8982 1341.1613 1342.1430 1367.9993 1383.0158 1384.5783 1386.0419 1440.6333 1452.0785 1453.7991 1454.2823 1454.7314 1455.5323 1456.3040 1457.8448 1637.2784 1662.9478 1664.5454 3007.0362 3007.9134 3009.3762 3021.9556 3033.5837 3037.6571 3050.1581 3097.2487 3098.2579 3100.8315 3103.4789 3106.7008 3121.2810 3141.6418 3141.9343 3142.4087
redmass: 1.1197 6.5813 4.9109 7.3560 4.6756 3.5373 4.6921 1.2393 1.2100 2.2700 3.7881 4.4289 4.8909 7.8402 5.4209 5.7208 5.0311 2.9554 2.5813 3.8278 2.8459 3.4488 4.0194 3.3503 3.6645 3.3040 3.4411 3.5841 4.6342 4.6540 4.7979 5.5698 4.1280 4.0653 5.2648 3.5892 4.5727 5.7736 5.2406 3.2809 3.4724 2.9940 1.9852 1.8647 2.4654 2.1334 3.2670 1.6673 1.6850 1.6346 3.8110 2.0153 2.8143 1.7355 2.8336 1.7373 3.4998 1.5366 1.3032 1.2448 1.4037 1.3583 1.3975 1.2492 1.2763 1.4276 1.2475 1.2678 1.2287 1.0892 1.0574 1.0736 1.0554 1.0516 1.0649 1.0664 1.0505 10.6036 9.5358 9.3162 1.0373 1.0376 1.0367 1.0621 1.0803 1.0746 1.0771 1.0970 1.0957 1.0952 1.0896 1.1064 1.1017 1.1012 1.1018 1.1021
irintensity: 1.6468 0.6243 1.2774 2.3966 1.4233 1.5390 2.8570 1.3286 0.8043 3.2097 0.3640 5.1132 3.1314 1.8629 10.5065 1.5932 11.4506 6.6643 8.8078 2.9124 12.1451 2.4890 12.5656 5.3929 13.7207 10.7168 5.7115 3.6449 13.4192 3.3316 6.7937 4.4704 11.4607 7.7561 129.8336 13.3256 41.1870 44.7707 199.1861 175.9228 40.5888 84.9036 18.0781 46.4329 101.9965 27.0735 26.4305 8.2236 5.6657 7.8531 107.6629 5.5093 21.1301 337.0719 427.8928 91.2158 92.7916 46.0952 10.5068 2.2896 1.3312 1.0044 11.7326 2.6870 7.0060 1.4695 45.6398 56.8010 64.4526 15.7993 26.3875 36.4199 19.7171 8.0174 33.0673 2.6468 16.5508 187.6732 108.5074 278.4551 1.7296 1.8178 2.0571 20.0041 12.0112 2.9676 21.8078 4.9086 8.1562 8.6992 9.0183 4.1287 4.7683 8.8846 9.4714 10.2904
temp: 298.150 k
press: 1.00000 atm
elementType: 8 8 8 8 8 8 8 6 6 6 6 6 6 6 6 6 6 6 1 1 1 1 1 1 1 1 1 1 1 1 1 1 1 1
symmnumber: 1
zpe: 691245.6 jmol-1
zpe.correction: 0.263282 hartree
zpe.thermalcorrener: 0.282755 hartree
zpe.thermalcorrenthalpy: 0.283699 hartree
zpe.thermalcorrgfe: 0.210420 hartree
zpe.sumelectzpe: -953.947282 hartree
zpe.sumelectthermal: -953.927808 hartree
zpe.sumelectthermalent: -953.926864 hartree
zpe.sumelectthermalfe: -954.000144 hartree
dipole: 4.2277 2.1930 -1.3610
dipole: 4.9533
quadrupole: -98.3567 -116.9788 -97.0870
quadrupole: 4.4133 4.8648 5.8837
quadrupole: 5.7841 -12.8380 7.0539 4.4133 4.8648 5.8837
hfenergy: -954.2105636 hartree
pointgroup: C01 [X(C11H16O7)]
dipole: 1.5215308 1.1226192 -0.4715708 debye
polarizability: 148.2919945|6.2984684|152.118684|-6.116111|-4.5411217|119.8664632 unknown
InChI: InChI=1S/C11H16O7/c1-6(12)15-5-10-9(16-7(2)13)4-11(18-10)17-8(3)14/h9-11H,4-5H2,1-3H3
charge 0 multiplicity 1
34 atoms
O  -0.345008 -0.993359 0.398143
O  1.54294 1.926571 0.449189
O  2.035037 -1.307613 0.20261
O  -2.738556 0.112455 -0.765138
O  -0.018111 3.519466 -0.224767
O  1.943984 -3.647383 0.313482
O  -3.933244 -1.001163 0.912649
C  0.438583 1.192075 1.136625
C  -0.483406 0.463696 0.110608
C  1.075353 0.068547 1.979636
C  0.872364 -1.200507 1.141206
C  -1.954609 0.84876 0.253522
C  1.167192 3.111636 -0.198574
C  2.430153 -2.608859 -0.179778
C  -3.663305 -0.839878 -0.296239
C  2.360639 3.794409 -0.824835
C  3.4992 -2.530493 -1.245801
C  -4.242957 -1.609758 -1.460541
H  -0.121699 1.927632 1.739957
H  -0.131741 0.648811 -0.920678
H  0.528814 -0.041384 2.931604
H  2.13551 0.270288 2.192718
H  0.773203 -2.15423 1.680949
H  -2.344213 0.598633 1.256758
H  -2.074622 1.922411 0.03521
H  3.273154 3.193177 -0.706866
H  2.504826 4.782791 -0.354071
H  2.161935 3.969894 -1.895946
H  3.983468 -3.51101 -1.361488
H  3.036356 -2.241448 -2.206731
H  4.24436 -1.758844 -0.992714
H  -5.177272 -2.102016 -1.15331
H  -4.419165 -0.945276 -2.32127
H  -3.519761 -2.383829 -1.775622
