program: Gaussian 09
title: 000286357
version: EM64L-G09RevD.01
frameworkgroup: C1[X(C11H16O2)]
method: RPBEPBE
basis: SDD
operation: Freq
keyword: #pfreq=noraman
keyword: PBEPBE/SDD
title: #p freq=noraman PBEPBE/SDD
converged: YES YES NO NO
title: Mulliken charges:
elementType: O O C C C C C C C C C C C H H H H H H H H H H H H H H H H
charge: -0.134383 -0.132582 -0.157472 -0.221895 0.234357 -0.447610 -0.447382 -0.394615 -0.409145 0.026653 0.018139 -0.732347 -0.753767 0.237801 0.255211 0.223670 0.200756 0.231642 0.204271 0.188859 0.205268 0.217338 0.209279 0.222890 0.226117 0.239737 0.213390 0.238189 0.237632
chargesum: 0.00000
title: Mulliken charges with hydrogens summed into heavy atoms:
elementType: O O C C C C C C C C C C C
charge: -0.134383 -0.132582 0.080329 0.033315 0.234357 -0.023183 -0.011468 -0.000488 0.017472 0.026653 0.018139 -0.043604 -0.064556
polarizability: 1.28474995e+02 -2.91468216e+00 1.14215266e+02 -2.67302142e+00 -3.23892709e+00 1.00648857e+02
1716.lowfreq: -5.8488 0.0007 0.0008 0.0009 13.0508 14.5116 57.0013 92.6461 136.7406
frequency: 56.9925 92.6429 136.7341 171.3172 188.6412 211.4073 229.4542 244.0545 282.8513 305.2885 321.8002 337.4233 371.0943 402.2543 405.3408 457.0661 520.6066 535.0320 602.4888 630.3873 663.9745 774.1522 787.7575 822.9976 844.3910 868.3934 903.7600 910.3771 934.5154 949.7159 969.6976 986.2915 1003.5079 1031.6166 1063.7933 1066.2676 1078.5754 1110.4323 1118.5562 1145.9842 1175.8564 1201.3066 1214.2537 1222.8762 1258.3686 1273.5781 1280.2064 1299.3775 1316.5124 1337.7416 1342.2620 1346.7387 1354.4956 1373.6937 1393.6446 1458.4983 1459.3311 1460.0601 1467.8848 1470.3910 1475.0215 1476.6675 1493.2612 1640.2359 1665.3431 2934.2071 2948.8964 2967.6327 2980.1850 2981.5625 2983.4758 2987.3612 2997.9851 3034.8295 3036.5085 3041.1656 3051.4681 3077.3885 3083.0042 3087.1657 3095.0898
redmass: 7.7521 3.8694 2.7300 1.9508 1.6578 1.4578 1.8425 2.0303 2.2747 4.4016 2.8398 2.0939 5.0737 3.4942 3.4836 2.5440 4.4570 2.6460 3.0615 3.9680 4.1359 2.3131 2.4849 3.0317 2.1006 2.5251 2.2114 1.9465 1.8679 1.5839 2.8983 1.5717 1.7904 2.8339 1.4469 1.7534 1.8350 1.2915 1.7002 2.5018 1.8178 1.6878 2.2227 1.6900 1.6936 1.8121 1.5449 1.4282 1.4935 1.3912 1.4167 1.4304 1.4560 1.1866 1.1956 1.0813 1.0813 1.0491 1.0847 1.0615 1.0824 1.0556 1.0586 12.0275 12.2278 1.0785 1.0669 1.0629 1.0347 1.0611 1.0648 1.0364 1.0847 1.0971 1.0966 1.0979 1.1036 1.0996 1.0997 1.1000 1.0991
irintensity: 0.1027 2.0292 0.8550 1.4380 0.8641 0.2872 1.5602 1.0956 2.6896 2.9212 1.7030 0.0210 3.7505 0.8003 0.3648 1.7440 1.9101 0.2945 1.6535 1.7997 0.6003 1.8171 1.9491 10.2943 4.7906 0.7265 8.5033 3.1237 5.2962 2.9272 20.5332 14.5534 18.5410 30.4016 2.6507 0.0081 11.2510 1.1098 0.6566 6.5771 5.2186 6.8122 1.5160 3.2371 8.9572 5.6173 13.0867 2.3610 4.3543 0.1648 1.1944 1.0367 2.1645 15.0884 16.6996 3.4986 19.5208 4.0718 13.7889 8.4329 8.4403 9.1132 11.9124 179.4677 20.9409 20.0109 20.3378 39.2518 21.0449 25.1593 32.6530 22.5717 29.3331 52.6290 61.7704 17.4130 58.8601 21.1866 15.6090 29.1824 28.7181
temp: 298.150 k
press: 1.00000 atm
elementType: 8 8 6 6 6 6 6 6 6 6 6 6 6 1 1 1 1 1 1 1 1 1 1 1 1 1 1 1 1
symmnumber: 1
zpe: 647677.2 jmol-1
zpe.correction: 0.246687 hartree
zpe.thermalcorrener: 0.259262 hartree
zpe.thermalcorrenthalpy: 0.260206 hartree
zpe.thermalcorrgfe: 0.208850 hartree
zpe.sumelectzpe: -578.202397 hartree
zpe.sumelectthermal: -578.189823 hartree
zpe.sumelectthermalent: -578.188878 hartree
zpe.sumelectthermalfe: -578.240235 hartree
dipole: -1.4444 -4.4557 2.8325
dipole: 5.4738
quadrupole: -79.9398 -88.1162 -77.6634
quadrupole: -3.3484 4.3773 5.1540
quadrupole: 1.9667 -6.2098 4.2430 -3.3484 4.3773 5.1540
hfenergy: -578.4490846 hartree
pointgroup: C01 [X(C11H16O2)]
dipole: -0.6986894 -1.7316638 1.0728296 debye
polarizability: 128.0520799|-3.7920579|114.8085469|-2.7231201|-2.7884482|100.4784907 unknown
InChI: InChI=1S/C11H16O2/c1-11(2)8-6-4-3-5-7(8)9(12)10(11)13/h7-8H,3-6H2,1-2H3
charge 0 multiplicity 1
29 atoms
O  -0.16527 2.559161 -0.397241
O  2.361336 1.110589 -1.104557
C  -0.171311 -0.947598 0.496939
C  -0.66882 0.483557 0.902455
C  1.371617 -0.76344 0.227153
C  -0.944266 -1.461588 -0.74662
C  -2.19613 0.712301 0.901738
C  -2.475666 -1.3349 -0.583438
C  -2.877958 0.140118 -0.361464
C  0.132588 1.405779 -0.014926
C  1.436393 0.638149 -0.407144
C  2.161598 -0.70697 1.575959
C  2.025086 -1.828537 -0.67952
H  -0.328362 -1.655367 1.334131
H  -0.29362 0.699319 1.928462
H  -0.663869 -2.512246 -0.9479
H  -0.640299 -0.87684 -1.642233
H  -2.392074 1.797825 0.987658
H  -2.62896 0.226933 1.798977
H  -2.812544 -1.946014 0.280029
H  -2.981421 -1.741207 -1.480111
H  -2.584413 0.738534 -1.24705
H  -3.975891 0.233849 -0.262733
H  1.758381 0.042502 2.280233
H  2.112737 -1.696799 2.065814
H  3.221917 -0.46202 1.388538
H  1.978652 -2.825156 -0.20319
H  1.536172 -1.891448 -1.666064
H  3.084897 -1.571285 -0.852296
