program: Gaussian 09
title: 000286377
version: EM64L-G09RevD.01
frameworkgroup: C1[X(C18H14N2O4S)]
method: RPBEPBE
basis: SDD
operation: Freq
keyword: #p
keyword: freq=noraman
keyword: PBEPBE/SDD
title: #p freq=noraman PBEPBE/SDD
converged: YES YES NO NO
title: Mulliken charges:
elementType: S O O O O N N C C C C C C C C C C C C C C C C C C H H H H H H H H H H H H H H
charge: 0.948346 -0.500875 -0.509977 -0.204131 -0.262441 -0.497748 0.003373 -0.194605 0.376132 -0.551377 -0.549749 0.327185 0.410146 0.014818 -0.655242 0.334653 -0.411979 -0.362130 -0.236187 -0.053153 -0.261847 -0.249568 -0.203192 -0.202940 -0.215177 0.247056 0.244275 0.241062 0.241687 0.295321 0.248302 0.293024 0.235836 0.332772 0.301122 0.291331 0.251108 0.243956 0.240807
chargesum: 0.00000
title: Mulliken charges with hydrogens summed into heavy atoms:
elementType: S O O O O N N C C C C C C C C C C C C C C C C C C
charge: 0.948346 -0.500875 -0.509977 -0.204131 -0.262441 -0.164976 0.003373 -0.194605 0.376132 -0.060045 -0.066999 0.327185 0.410146 0.014818 -0.359921 0.334653 -0.163677 -0.069106 -0.000350 -0.053153 0.039275 0.041763 0.047916 0.041016 0.025631
polarizability: 3.24430467e+02 -1.40746397e+01 2.96007391e+02 3.79171747e+01 3.35017447e+00 1.96303647e+02
1716.lowfreq: -12.1931 -5.7394 -3.0503 -0.0013 0.0008 0.0009 12.4455 20.8206 32.9214
frequency: 9.7799 20.6319 32.8475 46.1486 68.4655 73.1541 90.7376 103.1252 131.8449 141.1923 163.9571 177.1302 200.0736 221.0713 223.6570 240.6970 245.6522 321.5587 329.5344 352.6381 365.3400 386.9770 402.5370 411.5051 438.2215 445.4922 467.3026 478.8813 496.8852 505.8134 549.0830 588.1419 597.7570 600.1530 647.5231 651.3220 664.1138 677.2233 685.8595 706.3125 734.8686 757.8291 764.3490 793.5993 806.3436 815.6689 836.3853 844.7453 846.7146 901.1671 923.9414 930.3010 938.3455 953.9643 964.0369 973.6182 976.2590 983.8280 988.1928 1005.1753 1007.0266 1014.2684 1035.2591 1042.2572 1070.2570 1079.7150 1133.1531 1147.8281 1164.4687 1173.8276 1182.7412 1188.2612 1203.7050 1212.8980 1224.0012 1233.6116 1268.5243 1283.7035 1299.2896 1306.7934 1324.3817 1381.7471 1382.8729 1387.4392 1418.6917 1434.9096 1436.6660 1443.8129 1451.1875 1464.8893 1468.6504 1503.0917 1571.8384 1581.8392 1601.2229 1611.3373 1613.2749 2996.1610 3008.1043 3040.2225 3060.9293 3132.8505 3140.0707 3149.4235 3153.8179 3156.6129 3166.4979 3176.6544 3176.7367 3183.4737 3222.8440
redmass: 6.4724 5.1363 4.3435 7.0233 2.8067 8.0474 6.1316 4.1329 6.9064 5.9695 9.7086 9.3397 4.6804 3.8568 5.5846 8.7347 6.1667 8.6427 7.9184 5.7594 7.3593 8.4362 2.8306 8.2902 4.3916 4.5811 4.5489 5.4955 5.1110 5.2442 6.6405 2.8545 6.1839 6.4838 6.3533 6.4397 4.8430 7.7758 2.4412 4.8590 7.1092 1.4040 2.0897 1.4416 5.3591 9.5547 4.8060 2.2209 1.3449 1.4088 1.4965 1.3970 2.3615 3.7777 4.1194 6.2797 2.5240 1.3950 1.3882 4.6516 1.3412 1.9475 3.5485 2.0488 2.2133 1.6011 3.0926 1.1769 4.0863 1.0726 1.1333 1.2290 1.1140 3.6822 1.4325 1.9517 1.9542 2.0220 1.8397 1.2949 5.1897 3.5817 6.0105 3.8181 2.8690 3.3947 2.2753 1.1836 1.9871 1.3155 2.1068 4.2340 5.7439 8.1569 6.8758 7.1269 8.1168 1.0595 1.0622 1.1025 1.1021 1.0886 1.0860 1.0886 1.0937 1.0928 1.0970 1.1004 1.0932 1.0957 1.0751
irintensity: 1.7816 0.4434 0.7982 1.5976 0.7697 0.5623 2.0857 0.4026 1.7669 0.7412 4.0444 0.5698 4.4068 10.8489 1.1286 5.0135 5.8178 3.9285 0.4331 3.8163 37.8119 5.7755 0.1541 20.2978 4.3101 19.5788 7.8591 12.8601 115.9092 5.9495 1.5512 3.4236 5.3705 0.1199 8.9412 4.9770 2.0436 2.5101 32.2008 1.8386 6.9786 53.7226 27.1840 24.6421 6.4740 93.1185 66.6447 9.7295 2.1954 26.7678 24.8328 7.7824 93.6419 7.5504 3.8985 5.5841 44.1988 1.6217 3.2021 1.0389 0.5119 0.3031 8.8866 19.4510 0.7879 6.7006 4.9518 0.5245 323.4975 5.0073 15.3831 3.7565 1.1235 23.1768 0.6194 14.0898 9.2035 79.0030 2.8666 3.4754 82.4107 38.5665 9.1303 17.8452 26.8043 59.2016 7.9813 1.9032 13.0714 5.5615 24.6219 2.6598 8.0090 29.0287 0.9426 16.6421 45.5253 16.3028 34.4400 0.4895 21.6662 10.0176 1.7392 8.1718 21.7646 0.5104 2.4369 22.1447 3.4051 5.5963 68.4810
temp: 298.150 k
press: 1.00000 atm
elementType: 16 8 8 8 8 7 7 6 6 6 6 6 6 6 6 6 6 6 6 6 6 6 6 6 6 1 1 1 1 1 1 1 1 1 1 1 1 1 1
symmnumber: 1
zpe: 740569.3 jmol-1
zpe.correction: 0.282068 hartree
zpe.thermalcorrener: 0.303674 hartree
zpe.thermalcorrenthalpy: 0.304618 hartree
zpe.thermalcorrgfe: 0.228774 hartree
zpe.sumelectzpe: -1500.790831 hartree
zpe.sumelectthermal: -1500.769225 hartree
zpe.sumelectthermalent: -1500.768281 hartree
zpe.sumelectthermalfe: -1500.844125 hartree
dipole: 5.9263 1.9366 6.3976
dipole: 8.9331
quadrupole: -137.8061 -163.1729 -148.0738
quadrupole: -7.5643 -9.0350 3.0019
quadrupole: 11.8782 -13.4886 1.6105 -7.5643 -9.0350 3.0019
hfenergy: -1501.0728985 hartree
pointgroup: C01 [X(C18H14N2O4S1)]
dipole: 1.8050715 1.3338142 2.7045917 debye
polarizability: 312.483715|-5.2728625|293.4658257|56.6873293|-3.2140152|210.7919641 unknown
InChI: InChI=1S/C18H14N2O4S/c21-20(22)16-11-13-10-9-12-5-4-8-15(17(12)13)18(16)19-25(23,24)14-6-2-1-3-7-14/h1-8,11,19H,9-10H2
charge 0 multiplicity 1
39 atoms
S  -1.820166 -2.102483 -0.949451
O  -2.942493 -2.404269 -2.080679
O  -1.080136 -3.302762 -0.145741
O  -1.091533 3.188044 -1.797441
O  -1.620752 1.229753 -2.82695
N  -0.460813 -1.028175 -1.976104
N  -0.867169 1.933101 -2.013513
C  2.334895 0.225809 0.162882
C  2.204231 1.645736 0.080384
C  3.333915 2.294659 0.872678
C  4.158026 1.089002 1.469149
C  3.459248 -0.163247 0.942308
C  1.465924 -0.69704 -0.489081
C  0.367706 -0.150706 -1.272235
C  1.163818 2.18136 -0.665419
C  0.244582 1.286952 -1.312212
C  3.735459 -1.526953 1.083402
C  1.775443 -2.086898 -0.34674
C  2.884112 -2.475246 0.424884
C  -2.503234 -0.881909 0.33406
C  -3.371737 0.125365 -0.118026
C  -2.110106 -1.05234 1.670738
C  -3.874801 1.026647 0.848592
C  -2.631763 -0.142301 2.620094
C  -3.505177 0.891977 2.208549
H  3.964019 2.928751 0.221864
H  2.942464 2.952784 1.66995
H  4.1595 1.113366 2.574745
H  5.215722 1.126564 1.149939
H  0.999479 3.255233 -0.781054
H  4.590318 -1.881109 1.670255
H  1.153894 -2.839424 -0.837571
H  3.110933 -3.542704 0.520358
H  -1.095487 -0.517001 -2.631884
H  -3.65231 0.205769 -1.173347
H  -1.439723 -1.870747 1.952434
H  -4.549072 1.829746 0.535077
H  -2.355257 -0.244447 3.674494
H  -3.900861 1.594843 2.949511
