program: Gaussian 09
title: 000286370
version: EM64L-G09RevD.01
frameworkgroup: C1[X(C24H18N2O2)]
method: RPBEPBE
basis: SDD
operation: Freq
keyword: #p
keyword: freq=noraman
keyword: PBEPBE/SDD
title: #p freq=noraman PBEPBE/SDD
converged: YES YES NO NO
title: Mulliken charges:
elementType: O O N N C C C C C C C C C C C C C C C C C C C C C C C C H H H H H H H H H H H H H H H H H H
charge: -0.255989 -0.255988 -0.472883 -0.472885 0.212044 0.212045 0.315676 0.315670 -0.389251 -0.389234 -0.355004 -0.355019 -0.279025 -0.279020 0.129750 0.129741 0.244580 0.244613 -0.344392 -0.344363 -0.360628 -0.360633 -0.223138 -0.223147 -0.237361 -0.237365 -0.227078 -0.227077 0.310950 0.310958 0.195708 0.195712 0.308573 0.308569 0.232889 0.232890 0.274956 0.274949 0.220662 0.220655 0.234153 0.234153 0.230761 0.230761 0.234031 0.234031
chargesum: 0.00000
title: Mulliken charges with hydrogens summed into heavy atoms:
elementType: O O N N C C C C C C C C C C C C C C C C C C C C C C C C
charge: -0.255989 -0.255988 -0.164309 -0.164316 0.212044 0.212045 0.315676 0.315670 -0.078301 -0.078276 -0.159296 -0.159306 -0.046136 -0.046130 0.129750 0.129741 0.244580 0.244613 -0.069436 -0.069414 -0.139967 -0.139978 0.011015 0.011006 -0.006600 -0.006604 0.006953 0.006954
polarizability: 5.66934478e+02 -4.15537023e-03 3.00783424e+02 -7.58524836e+00 3.92154706e-03 1.29893511e+02
1716.lowfreq: -5.6614 -3.2461 -2.8364 -0.0004 0.0006 0.0010 11.9710 14.9114 28.6672
frequency: 11.8282 14.9091 28.5892 36.0137 45.3259 56.0932 75.8705 83.4929 97.0636 116.3307 124.9915 176.7272 185.0079 193.9364 227.6212 240.3695 264.6230 311.6493 314.1395 381.2846 399.6469 402.1678 402.3833 419.9290 423.0398 461.4406 462.7391 469.9278 508.3124 515.2374 520.7180 575.8551 580.8866 611.3807 614.1369 617.3591 642.3588 644.3457 662.3447 662.8102 686.0318 686.4900 703.4007 703.6225 725.8653 754.2833 764.0189 772.5855 787.6366 789.4458 804.4261 842.9403 852.6802 853.6555 863.1143 881.2917 891.8381 932.9783 933.3670 934.4184 976.6829 982.7935 982.8188 986.1025 989.1183 990.1625 998.5319 1005.3720 1005.4143 1016.6292 1028.6717 1036.3184 1056.3382 1083.5020 1084.6686 1105.6001 1112.8220 1173.9026 1174.3626 1174.3796 1190.2544 1191.1193 1192.3924 1200.7768 1236.5272 1247.2752 1283.5127 1284.3364 1286.9192 1318.3532 1318.6472 1367.6047 1382.2204 1384.5457 1385.3467 1400.6914 1428.9957 1433.1999 1438.1701 1452.9520 1475.4205 1479.1920 1493.4851 1498.0760 1547.5427 1574.1175 1578.3600 1593.2679 1596.4942 1608.7471 1609.9586 1610.2059 1611.2656 1629.5547 3110.0465 3110.1876 3112.0600 3115.4252 3132.6672 3132.6709 3144.7079 3145.3933 3145.3966 3158.9107 3158.9228 3166.3568 3170.5613 3170.6101 3189.2533 3202.4987 3557.0650 3557.2934
redmass: 5.9852 5.1091 4.2900 5.3327 5.2836 6.0324 5.7703 5.7280 3.4901 4.3848 6.6772 4.8128 5.4310 4.5173 5.6150 5.9836 5.8999 7.4127 9.3752 4.5858 3.6717 2.8280 2.8119 3.5727 5.4122 4.9935 4.6585 3.6481 5.2111 5.6596 6.6648 1.6480 5.5878 2.3689 6.3681 2.0850 2.0256 3.5778 5.3620 6.4056 5.3027 4.8183 1.5336 1.5348 6.0095 1.4938 5.8260 2.5288 2.6257 2.3641 4.4955 2.0587 1.4039 1.2670 4.0921 3.1542 1.6236 1.4485 1.4361 1.4094 1.3504 1.4586 1.4540 4.7202 4.9071 4.4655 1.4096 1.3436 1.3488 4.1512 2.2432 2.7827 2.1303 1.6361 1.6031 2.6120 2.7343 1.7499 1.0748 1.0576 1.1152 1.1192 1.0979 1.4570 2.1524 3.1263 1.9680 3.3239 1.9164 1.3399 1.3600 5.8663 2.6876 8.8182 3.8953 8.2512 2.1994 2.2622 2.2658 2.5769 2.1883 2.2848 2.4359 2.3646 2.9279 6.8007 5.3448 5.5875 7.3217 5.0946 6.1535 5.6472 5.7708 4.5782 1.0881 1.0883 1.0861 1.0876 1.0866 1.0866 1.0923 1.0917 1.0918 1.0956 1.0956 1.1002 1.1006 1.1006 1.0908 1.0954 1.0747 1.0747
irintensity: 2.3637 0.0722 0.1704 0.5796 0.1282 5.3928 0.1818 4.2484 0.0080 0.7187 0.0000 3.8942 0.0738 6.1986 0.3670 4.8646 13.2917 8.6377 1.1075 0.1959 4.7713 0.0059 0.1923 6.2568 1.0089 0.2031 11.8229 0.0027 3.4919 1.3239 10.6099 23.6017 7.4562 0.2203 1.3244 0.6538 37.5465 0.0894 48.8434 0.0266 2.0622 32.6009 43.9519 157.1489 0.0101 108.0450 5.2197 0.4111 23.0047 16.2310 9.9593 0.1247 0.3196 2.9014 0.3685 41.3954 58.2944 1.3078 5.6049 0.4183 0.0193 6.5840 0.0094 0.6333 0.3546 0.0068 0.1447 3.9037 0.0032 34.7406 0.2395 0.9708 8.9310 20.1800 26.5753 0.0436 22.3161 4.7338 2.2830 0.0612 3.2567 34.9315 0.0236 5.8629 151.0976 0.8670 17.9661 0.5378 356.4276 12.7422 0.8483 63.3365 27.4347 5.4092 7.7811 38.1185 138.9863 2.3514 93.5533 0.2551 11.4909 52.0448 128.9872 1368.4972 47.4636 4.0888 72.6151 0.2810 0.9556 4.5227 0.6666 39.9769 110.7327 14.5248 54.1471 2.9709 20.6303 0.9251 0.7067 0.2151 36.0564 19.9818 16.6981 20.5370 12.9250 24.5237 54.7559 0.0919 3.3538 6.5505 0.2022 27.2534
temp: 298.150 k
press: 1.00000 atm
elementType: 8 8 7 7 6 6 6 6 6 6 6 6 6 6 6 6 6 6 6 6 6 6 6 6 6 6 6 6 1 1 1 1 1 1 1 1 1 1 1 1 1 1 1 1 1 1
symmnumber: 1
zpe: 936201.8 jmol-1
zpe.correction: 0.356580 hartree
zpe.thermalcorrener: 0.379427 hartree
zpe.thermalcorrenthalpy: 0.380371 hartree
zpe.thermalcorrgfe: 0.300404 hartree
zpe.sumelectzpe: -1183.448636 hartree
zpe.sumelectthermal: -1183.425790 hartree
zpe.sumelectthermalent: -1183.424845 hartree
zpe.sumelectthermalfe: -1183.504813 hartree
dipole: 0.0001 6.9288 0.0005
dipole: 6.9288
quadrupole: -108.0768 -160.2312 -167.5579
quadrupole: -0.0015 1.5794 -0.0005
quadrupole: 37.2118 -14.9426 -22.2692 -0.0015 1.5794 -0.0005
hfenergy: -1183.8052166 hartree
pointgroup: C01 [X(C24H18N2O2)]
dipole: 0.0000235 -2.7259938 0.0003667 debye
polarizability: 567.046295|0.0024884|300.7834231|2.9419402|-0.0147521|129.7816954 unknown
InChI: InChI=1S/C24H18N2O2/c27-23(17-9-3-1-4-10-17)25-21-15-16-22(20-14-8-7-13-19(20)21)26-24(28)18-11-5-2-6-12-18/h1-16,25-26H
charge 0 multiplicity 1
46 atoms
O  3.390946 2.333034 0.304418
O  -3.390954 2.332719 -0.304414
N  2.855475 0.059194 0.00459
N  -2.855379 0.058952 -0.004278
C  0.726176 -1.185349 0.020504
C  -0.72597 -1.185421 -0.019981
C  1.436002 0.080597 0.017315
C  -1.435911 0.080461 -0.017033
C  0.708765 1.281297 0.007784
C  -0.708786 1.281229 -0.007757
C  1.403749 -2.450257 0.060175
C  -1.403424 -2.450401 -0.059419
C  0.711797 -3.662523 0.036339
C  -0.711358 -3.662597 -0.035353
C  3.748756 1.131594 0.102178
C  -3.74872 1.131278 -0.102106
C  5.203371 0.752551 -0.02757
C  -5.203298 0.752238 0.028079
C  6.155632 1.617541 0.570604
C  -6.155724 1.617102 -0.570012
C  5.657239 -0.386883 -0.744862
C  -5.656965 -0.38707 0.745699
C  7.533502 1.334009 0.481632
C  -7.533567 1.33356 -0.480644
C  7.038558 -0.666613 -0.838475
C  -7.038256 -0.66681 0.839707
C  7.979524 0.187787 -0.218955
C  -7.979392 0.187459 0.220266
H  1.249857 2.228161 0.022431
H  -1.249965 2.228041 -0.022602
H  2.496921 -2.49985 0.130184
H  -2.49659 -2.50011 -0.12944
H  3.290949 -0.860649 -0.058505
H  -3.290791 -0.860903 0.059082
H  1.259714 -4.609721 0.072475
H  -1.259184 -4.609853 -0.071317
H  5.788746 2.508078 1.091035
H  -5.788985 2.50755 -1.0907
H  4.951018 -1.035283 -1.279526
H  -4.950598 -1.035355 1.280307
H  8.259655 2.00477 0.953421
H  -8.25985 2.00422 -0.952376
H  7.380008 -1.539782 -1.405107
H  -7.379548 -1.539881 1.406587
H  9.050582 -0.030588 -0.292319
H  -9.050428 -0.030922 0.29394
