program: Gaussian 09
title: 000283431
version: EM64L-G09RevD.01
frameworkgroup: C1[X(C10H19NO3)]
method: RPBEPBE
basis: SDD
operation: Freq
keyword: #p
keyword: freq=noraman
keyword: PBEPBE/SDD
title: #p freq=noraman PBEPBE/SDD
converged: YES YES NO NO
title: Mulliken charges:
elementType: O O O N C C C C C C C C C C H H H H H H H H H H H H H H H H H H H
charge: -0.159354 -0.193171 -0.187909 0.153018 -0.381570 -0.370042 -0.371977 -0.374592 -0.353234 -0.512365 -0.356551 0.217252 -0.695256 -0.456512 0.196276 0.197314 0.190661 0.191128 0.189553 0.189397 0.230257 0.219524 0.189295 0.189568 0.250740 0.241304 0.194761 0.194832 0.216079 0.210281 0.210443 0.268942 0.271906
chargesum: 0.00000
title: Mulliken charges with hydrogens summed into heavy atoms:
elementType: O O O N C C C C C C C C C C
charge: -0.159354 -0.193171 -0.187909 0.153018 0.012020 0.011748 0.006973 0.075189 0.025629 -0.020321 0.033042 0.217252 -0.058453 0.084336
polarizability: 1.69905424e+02 1.84471077e+00 1.09184523e+02 4.10536386e-01 1.66340779e+00 1.08604750e+02
1716.lowfreq: -3.7019 -0.0002 0.0004 0.0008 4.3388 6.9432 21.4562 33.9745 41.3497
frequency: 21.2903 32.6190 38.8312 43.9861 46.9641 67.1772 86.7756 98.1523 115.2285 139.3265 150.3799 154.2586 182.7945 226.2333 227.7033 332.6976 341.5455 420.7180 446.5835 454.4784 468.9947 529.1074 625.1023 718.0963 724.5019 730.7366 737.6088 775.6068 832.9444 859.3691 867.4641 889.2959 902.2161 949.6543 985.2838 1009.7274 1016.8627 1029.8496 1058.6487 1079.2926 1080.8912 1084.8884 1097.4426 1123.8148 1169.1333 1189.4228 1218.1798 1221.2570 1223.2619 1257.8400 1260.6893 1282.5364 1285.2546 1289.9708 1296.5440 1299.6820 1301.7953 1331.0889 1352.3166 1357.7763 1361.3831 1390.6686 1411.9513 1428.0460 1436.0771 1462.6036 1463.4818 1466.6004 1471.8373 1477.1355 1478.6174 1485.3352 1490.0008 1661.1734 2950.7448 2952.0921 2953.4623 2955.6785 2963.7345 2969.6349 2973.1709 2986.4653 2992.8423 2997.0227 2999.1578 3005.1429 3023.8073 3035.8301 3039.5319 3062.1246 3069.7519 3071.9303 3112.3089
redmass: 6.5743 4.1219 3.2553 3.7991 4.6227 2.1925 2.0105 4.4880 2.0474 1.9712 5.1975 2.0696 5.5965 3.3594 1.2390 3.5394 4.1185 2.0839 3.0628 2.9428 3.5144 8.2196 6.2448 1.1318 1.0695 6.0517 1.1517 1.2299 1.4058 3.7865 6.4763 1.8832 1.4330 1.4008 4.5563 1.2458 3.8308 2.8080 3.1616 2.2763 2.1544 2.2305 1.4099 2.9518 1.4358 1.6364 1.7687 2.4062 1.4092 1.3036 1.2949 1.0463 1.1284 1.5229 1.0931 1.2114 1.3575 1.4747 1.5821 1.6509 1.6402 1.2172 1.0871 1.0943 6.0917 1.0736 1.0699 1.0691 1.0769 1.0423 1.0777 1.0879 1.0952 8.7226 1.0592 1.0595 1.0598 1.0591 1.0593 1.0589 1.0363 1.0967 1.0964 1.0680 1.0912 1.1018 1.1043 1.0568 1.1046 1.1034 1.1007 1.0993 1.1059
irintensity: 0.8588 2.2462 1.6991 0.3401 2.0267 0.5057 0.1370 2.6614 0.3106 0.0200 0.2802 0.0467 0.4850 1.6858 0.2096 0.0254 4.3336 0.6561 0.1012 0.0279 1.7367 2.9254 24.6765 9.8482 10.2917 4.7973 1.5001 0.4953 0.5822 0.6285 13.1270 7.1853 1.6107 0.5354 17.0569 1.2313 16.3311 36.4225 14.5245 1.4007 0.3832 12.5094 7.9169 35.8242 12.6732 2.9627 139.6992 56.5028 0.5580 6.4978 6.1063 0.1211 0.8923 16.0635 0.2576 7.2912 13.3881 13.9463 2.9682 2.4528 4.3278 11.2840 18.8815 32.3595 155.5053 0.3992 0.0773 0.8327 1.4064 12.5364 4.1149 1.6713 30.2092 80.3791 1.6702 4.0178 21.1938 0.4195 16.6616 149.8219 37.6989 1.1972 4.9830 24.8711 7.0175 1.3174 0.0305 5.0287 101.1957 67.9878 99.4144 54.0591 0.1188
temp: 298.150 k
press: 1.00000 atm
elementType: 8 8 8 7 6 6 6 6 6 6 6 6 6 6 1 1 1 1 1 1 1 1 1 1 1 1 1 1 1 1 1 1 1
symmnumber: 1
zpe: 734155.6 jmol-1
zpe.correction: 0.279625 hartree
zpe.thermalcorrener: 0.296942 hartree
zpe.thermalcorrenthalpy: 0.297886 hartree
zpe.thermalcorrgfe: 0.230641 hartree
zpe.sumelectzpe: -671.655373 hartree
zpe.sumelectthermal: -671.638056 hartree
zpe.sumelectthermalent: -671.637112 hartree
zpe.sumelectthermalfe: -671.704357 hartree
dipole: 4.7013 4.4861 -0.9359
dipole: 6.5653
quadrupole: -121.1529 -87.3797 -87.1184
quadrupole: -17.0770 4.0393 -0.6303
quadrupole: -22.6025 11.1706 11.4319 -17.0770 4.0393 -0.6303
hfenergy: -671.9349979 hartree
pointgroup: C01 [X(C10H19N1O3)]
dipole: -1.8656166 -1.773956 -0.2106908 debye
polarizability: 169.9364246|1.2366056|108.8489868|-0.423606|-1.6795242|108.9092852 unknown
InChI: InChI=1S/C10H19NO3/c1-2-3-4-5-6-7-8-10(12)9-11(13)14/h2-9H2,1H3
charge 0 multiplicity 1
33 atoms
O  2.743267 1.268321 0.101493
O  5.608542 0.03246 1.230682
O  5.707471 0.355675 -1.032575
N  5.171181 -0.125456 0.031665
C  -2.494706 0.289647 -0.028507
C  -1.244728 -0.615932 0.048051
C  -3.823248 -0.496348 0.04295
C  0.075715 0.181141 -0.032996
C  -5.072621 0.410895 -0.022324
C  1.315571 -0.729553 0.057731
C  -6.40281 -0.373635 0.048113
C  2.640418 0.02629 0.020744
C  -7.645109 0.541202 -0.014474
C  3.882225 -0.894845 -0.131472
H  -2.465842 0.875995 -0.97044
H  -2.461323 1.029109 0.798327
H  -1.272529 -1.194988 0.995248
H  -1.283374 -1.360835 -0.774567
H  -3.849942 -1.088163 0.982071
H  -3.860854 -1.231106 -0.788651
H  0.116615 0.930483 0.779663
H  0.111204 0.755091 -0.979058
H  -5.0479 1.00443 -0.960246
H  -5.037534 1.144786 0.809902
H  1.291739 -1.313005 1.004306
H  1.310705 -1.488374 -0.752924
H  -6.438544 -1.105787 -0.784486
H  -6.425744 -0.967381 0.984899
H  -8.582462 -0.042421 0.040313
H  -7.662706 1.121541 -0.95637
H  -7.647139 1.263709 0.823449
H  3.863885 -1.687124 0.634814
H  3.887773 -1.341621 -1.13993
