program: Gaussian 09
title: 000286346
version: EM64L-G09RevD.01
frameworkgroup: C1[X(C12H11N3O2)]
method: RPBEPBE
basis: SDD
operation: Freq
keyword: #p
keyword: freq=noraman
keyword: PBEPBE/SDD
title: #p freq=noraman PBEPBE/SDD
converged: YES YES NO NO
title: Mulliken charges:
elementType: O O N N N C C C C C C C C C C C C H H H H H H H H H H H
charge: -0.246323 -0.300139 -0.013041 -0.617250 -0.593291 0.349446 -0.474128 0.243547 -0.072834 -0.306844 -0.376485 0.202605 0.234563 -0.301450 -0.396242 -0.263050 -0.227450 0.285356 0.272357 0.228299 0.264255 0.243027 0.231424 0.235452 0.371221 0.331274 0.356737 0.338963
chargesum: 0.00000
title: Mulliken charges with hydrogens summed into heavy atoms:
elementType: O O N N N C C C C C C C C C C C C
charge: -0.246323 -0.300139 -0.013041 0.085246 0.102409 0.349446 -0.188772 0.243547 -0.072834 -0.034487 -0.148186 0.202605 0.234563 -0.037196 -0.153216 -0.031626 0.008002
polarizability: 2.00533592e+02 6.64655709e+00 1.68748914e+02 -1.47013338e+00 1.70031408e+01 9.80510061e+01
1716.lowfreq: -11.7794 -0.0002 0.0008 0.0009 4.3525 11.0487 27.1704 45.2865 68.2358
frequency: 27.0920 45.2524 68.2289 78.9684 125.7571 156.6079 178.0229 210.0238 278.5529 287.6743 331.8841 382.7213 413.0518 434.2011 470.2417 487.1767 517.1872 520.8733 531.0895 544.7502 588.0654 596.9444 610.7370 637.4445 656.6045 666.0013 687.3022 755.5511 766.4490 772.1336 797.3915 807.5961 840.8023 853.9548 877.9620 902.1635 911.3702 961.7092 969.4388 998.9201 1021.8532 1033.8922 1064.2514 1085.8911 1103.9827 1147.1938 1177.1562 1208.8543 1222.0495 1235.2553 1257.3449 1288.8694 1307.3753 1339.9830 1357.1039 1376.7725 1388.7958 1432.1974 1452.8528 1508.4360 1549.8602 1552.8147 1581.9063 1589.3069 1620.8903 1641.0420 1653.0565 3011.2997 3129.1420 3130.1748 3143.1404 3158.3433 3174.0373 3190.3033 3390.2581 3507.0449 3625.1727 3658.6980
redmass: 7.0917 5.2564 5.3100 6.3100 5.7070 4.5058 4.7333 6.1646 6.8523 5.0060 5.0781 5.5982 4.3196 3.3762 3.1601 3.1896 5.3218 4.6528 2.0622 3.3231 1.2503 3.2534 1.8047 3.3000 3.8427 2.4106 2.3865 1.1214 2.1662 2.1631 3.0852 5.6941 2.0854 2.3106 1.8126 4.9199 3.4115 1.4211 1.3962 1.3307 3.1467 2.1911 1.9092 2.6414 2.0004 1.3718 1.2172 1.3387 1.9159 1.7713 2.0858 1.7246 2.9754 3.1188 3.5497 2.5579 2.2847 2.6997 2.6769 3.6584 3.0056 3.2755 4.2205 1.3088 6.2491 2.2950 7.3327 1.0806 1.0908 1.0852 1.0897 1.0953 1.0996 1.0940 1.0559 1.0451 1.0953 1.1044
irintensity: 0.0571 3.2625 1.5834 9.3812 0.3796 1.6752 1.1839 18.0797 0.8013 4.9675 17.9982 7.9070 9.2432 9.2473 0.0867 3.5467 1.4632 3.8587 17.5810 25.3750 55.6574 24.5016 159.9484 34.9074 2.4742 37.1323 50.2819 114.9532 78.7044 40.8331 6.1634 1.0977 16.6274 20.5648 0.1969 1.2934 8.8765 1.0890 2.4609 0.3616 2.4394 7.2522 0.6207 5.4591 0.6478 2.5105 4.4403 55.9173 0.6638 2.1167 16.5446 12.7361 165.6239 2.5845 111.6043 4.0500 10.2943 10.4549 3.0728 27.7615 179.8952 135.3845 44.2285 152.8342 2.5281 62.7546 373.9077 5.8458 25.1243 0.9390 14.1299 20.0809 19.1087 1.6489 112.2139 39.2537 75.9959 69.2435
temp: 298.150 k
press: 1.00000 atm
elementType: 8 8 7 7 7 6 6 6 6 6 6 6 6 6 6 6 6 1 1 1 1 1 1 1 1 1 1 1
symmnumber: 1
zpe: 562630.7 jmol-1
zpe.correction: 0.214295 hartree
zpe.thermalcorrener: 0.228532 hartree
zpe.thermalcorrenthalpy: 0.229476 hartree
zpe.thermalcorrgfe: 0.172112 hartree
zpe.sumelectzpe: -777.423500 hartree
zpe.sumelectthermal: -777.409262 hartree
zpe.sumelectthermalent: -777.408318 hartree
zpe.sumelectthermalfe: -777.465682 hartree
dipole: 0.2995 -2.6841 2.0743
dipole: 3.4054
quadrupole: -93.5278 -104.0484 -93.5049
quadrupole: 7.6113 1.8618 7.0297
quadrupole: 3.4992 -7.0214 3.5222 7.6113 1.8618 7.0297
hfenergy: -777.6377944 hartree
pointgroup: C01 [X(C12H11N3O2)]
dipole: 0.2193749 0.203483 -1.3059572 debye
polarizability: 197.3556259|7.545305|151.4035077|19.4702476|-32.9439989|118.5743783 unknown
InChI: InChI=1S/C12H11N3O2/c13-11(16)10(12(14)17)8-5-6-15-9-4-2-1-3-7(8)9/h1-6,10H,13-14H2
charge 0 multiplicity 1
28 atoms
O  2.290387 0.208228 2.317068
O  2.962733 1.448955 -1.753392
N  -2.00026 -1.942496 0.649613
N  3.578919 1.56255 0.937362
N  1.780812 -0.517959 -2.05948
C  0.229214 -0.142879 0.269616
C  1.413666 0.782379 0.043464
C  -1.093831 0.233191 -0.186177
C  -2.180739 -0.70542 0.038777
C  0.380741 -1.398578 0.873584
C  -1.396638 1.466871 -0.854373
C  2.475062 0.792349 1.211765
C  2.114031 0.595506 -1.33332
C  -3.508022 -0.370296 -0.380155
C  -0.751134 -2.256428 1.039615
C  -2.701144 1.766792 -1.255471
C  -3.7682 0.845408 -1.014213
H  1.058805 1.830673 0.017485
H  1.350615 -1.712442 1.263624
H  -0.601436 2.189341 -1.066248
H  -4.294607 -1.104747 -0.182231
H  -0.625891 -3.233523 1.521024
H  -2.909767 2.715728 -1.761508
H  -4.785777 1.096787 -1.331886
H  3.709365 1.950444 -0.00684
H  4.29417 1.656358 1.65758
H  1.092747 -1.190167 -1.720086
H  2.22918 -0.660324 -2.964594
