program: Gaussian 09
title: 000286408
version: EM64L-G09RevD.01
frameworkgroup: C1[X(C24H23ClFN5O4S)]
method: RPBEPBE
basis: SDD
operation: Freq
keyword: #p
keyword: freq=noraman
keyword: PBEPBE/SDD
title: #p freq=noraman PBEPBE/SDD
converged: YES YES NO NO
title: Mulliken charges:
elementType: Cl S F O O O O N N N N N C C C C C C C C C C C C C C C C C C C C C C C C H H H H H H H H H H H H H H H H H H H H H H H
charge: -0.025016 0.947402 -0.195014 -0.275388 -0.390509 -0.496631 -0.494401 -0.317349 -0.093777 -0.172120 -0.632893 -0.613619 0.188187 -0.705729 -0.684608 0.353139 0.229127 -0.022217 -0.313464 -0.377839 0.510032 -0.344100 -0.325907 -0.388237 0.391987 -0.063396 -0.348629 -0.380540 -0.245981 -0.227658 0.306256 -0.281168 -0.285433 -0.326383 -0.325995 0.325709 0.243937 0.205129 0.227415 0.238385 0.232568 0.209189 0.283972 0.263263 0.257020 0.335941 0.339138 0.233276 0.235635 0.321180 0.317032 0.242210 0.299434 0.285645 0.284154 0.262350 0.261059 0.262291 0.261940
chargesum: 0.00000
title: Mulliken charges with hydrogens summed into heavy atoms:
elementType: Cl S F O O O O N N N N N C C C C C C C C C C C C C C C C C C C C C C C C
charge: -0.025016 0.947402 -0.195014 -0.275388 -0.390509 -0.496631 -0.494401 -0.317349 -0.093777 -0.172120 0.042186 0.024594 0.188187 -0.029247 -0.004466 0.353139 0.229127 -0.022217 -0.029493 -0.114576 0.510032 -0.344100 -0.068886 0.080674 0.391987 -0.063396 -0.106419 -0.081106 0.039664 0.056496 0.306256 -0.018818 -0.024374 -0.064092 -0.064055 0.325709
polarizability: 6.68810758e+02 -5.55222252e+01 2.89615781e+02 -3.59420482e+00 -2.63474479e+01 2.68343002e+02
1716.lowfreq: -4.6878 -3.9426 -0.0014 -0.0012 -0.0002 2.2235 4.6664 5.7948 11.6892
frequency: 3.5116 4.9093 11.0685 15.9415 21.3225 23.1921 29.7046 40.3863 43.7668 49.2803 62.7573 82.2712 90.2638 112.5675 118.2499 122.1022 129.5274 137.7163 154.4309 170.2751 177.6942 191.5375 206.7624 217.4781 227.0661 236.2047 256.6892 268.7785 285.7131 299.5837 308.3611 311.7318 318.2680 339.8982 347.3866 372.0575 375.1900 378.4782 383.3828 384.3594 390.1929 405.1406 412.6865 421.8303 422.8290 430.6603 435.5220 448.9188 472.2994 487.4366 503.5892 512.2134 518.1067 520.0449 528.2873 536.0189 543.1804 556.9715 592.4922 616.7005 618.3878 622.5549 635.1214 663.6908 669.3389 706.0031 713.0319 713.3491 724.9282 726.2882 731.8205 800.2226 803.2247 806.7182 812.6161 819.6550 827.1065 828.1472 829.9438 850.7730 857.6876 860.7761 892.3133 910.0149 942.5470 944.5987 946.5646 946.8918 954.5643 959.3302 964.2203 989.4541 991.1075 994.7194 995.1403 997.4334 1024.0190 1035.1408 1049.5980 1052.1661 1093.2703 1104.5964 1117.5783 1120.0214 1129.7120 1140.5863 1145.6011 1168.1191 1185.1018 1190.7316 1207.8393 1210.5483 1214.0341 1217.5681 1249.2191 1260.9107 1277.6870 1289.5444 1294.9352 1335.5907 1351.5011 1362.3765 1365.9691 1385.0866 1392.5651 1397.1747 1403.9197 1408.0753 1413.8430 1445.2816 1448.6588 1460.4323 1462.4977 1466.6829 1469.9580 1472.8839 1476.5261 1486.9192 1532.7124 1553.1484 1569.6332 1574.8181 1590.9991 1594.7071 1600.2473 1603.8024 1611.0782 1617.7630 2943.5132 2980.6563 2997.0763 2997.5124 3079.8819 3094.6888 3100.1806 3110.5126 3130.7665 3153.0667 3161.5818 3165.8163 3166.4849 3168.1327 3170.7905 3173.8086 3183.9543 3186.5884 3187.5345 3554.0830 3568.1047 3708.7373 3730.2908
redmass: 8.1042 7.1420 5.7448 6.7942 7.6554 4.3111 6.5974 5.8115 5.3585 6.5828 7.6746 5.9657 6.0492 8.4293 5.3707 5.0548 8.9495 4.6494 4.5915 10.7235 6.2667 6.4698 3.8718 4.4396 1.6861 2.8020 9.3983 1.0348 4.7629 3.3465 3.4166 3.7816 4.3428 5.9573 4.8262 7.5257 1.5267 5.9120 1.3823 2.2084 5.4189 2.8771 3.2614 6.5106 6.8016 4.6482 5.3675 3.2364 6.5946 3.1772 1.9741 3.4005 4.5721 1.7138 1.5220 2.2245 2.8353 4.1659 4.8368 4.5101 6.4971 7.2293 5.7497 6.5298 8.1361 3.5233 4.3696 4.7698 10.9566 5.6112 5.3830 3.0681 1.2426 2.7508 2.1849 7.1080 2.2204 2.5079 5.5196 1.8257 1.2732 2.8137 1.4753 1.5820 16.1567 1.5549 1.8410 1.3714 1.3647 3.2994 1.3235 1.4778 4.4036 1.4152 2.6816 6.6761 1.7038 2.9902 3.3464 2.4141 1.2774 1.9456 1.3367 2.2215 2.0404 1.3413 1.3203 2.9420 1.1206 3.4411 2.4344 4.0494 1.0741 2.0732 3.9975 2.0409 1.2759 3.2780 1.3070 3.0258 2.6333 5.9651 1.2283 1.2855 5.0502 4.1042 4.3620 2.5967 4.2114 4.3971 1.0536 1.0885 1.2600 2.4644 1.0713 2.3429 1.0621 2.1839 2.5599 7.2553 1.7466 7.7882 6.2628 7.4755 5.9289 3.5334 3.4224 2.1280 1.0552 1.0349 1.1044 1.0362 1.1002 1.0997 1.1006 1.0992 1.0900 1.0879 1.0904 1.0886 1.0889 1.0955 1.0941 1.0955 1.0978 1.0958 1.0986 1.0444 1.0437 1.1052 1.1059
irintensity: 0.0659 0.2196 0.0859 0.3779 0.5796 0.1799 1.2322 0.3805 0.2454 1.3577 0.4741 0.4800 2.4388 1.2425 1.6993 2.3367 12.1908 5.9919 0.0011 0.3677 1.4776 4.7821 1.3265 0.7222 4.6863 13.1011 15.2793 0.2921 12.0886 7.5703 10.1697 9.9191 3.9681 3.8557 21.8797 7.6705 26.8096 14.3946 313.5962 28.9417 28.5047 0.0709 0.2107 86.7074 7.6472 0.9831 39.0629 8.9819 35.1574 27.2319 30.4114 80.7355 4.3309 21.2942 6.6685 36.0122 9.5486 5.1474 24.4768 2.4041 0.9582 0.3989 5.8630 2.3995 1.5919 3.8079 13.0712 18.6658 34.6868 40.4843 30.8879 4.6193 0.3122 51.4408 51.6376 61.8541 13.1385 25.6110 19.0986 109.4480 5.1822 4.3738 4.1148 1.5062 59.6466 9.0665 10.1694 0.4737 0.1193 13.9933 0.7240 10.7788 56.1142 0.9390 4.4426 37.3813 3.0270 85.3191 12.2408 45.6485 13.4581 6.3457 8.7807 4.1007 55.1414 77.0873 21.4755 50.1050 5.0334 30.3914 106.0767 65.9273 2.7945 175.3012 149.4082 227.8120 0.8198 2.2540 14.5882 9.0380 59.4456 2.0547 35.8653 27.7923 15.7551 160.8918 358.4507 24.3963 3.9287 145.9425 0.9927 10.8660 236.8129 75.2291 6.9072 2.4043 25.1353 274.5603 283.8882 19.5766 190.2866 3.1206 178.4237 0.7542 16.0303 341.8905 352.2850 465.6936 24.7132 16.0365 17.1876 20.7291 28.7428 12.9546 33.6950 31.8853 10.7538 15.4386 3.3508 4.0033 1.0874 7.3760 2.8960 2.2852 1.6746 0.5096 5.2505 56.9932 97.2485 58.0527 38.0458
temp: 298.150 k
press: 1.00000 atm
elementType: 17 16 9 8 8 8 8 7 7 7 7 7 6 6 6 6 6 6 6 6 6 6 6 6 6 6 6 6 6 6 6 6 6 6 6 6 1 1 1 1 1 1 1 1 1 1 1 1 1 1 1 1 1 1 1 1 1 1 1
symmnumber: 1
zpe: 1139218.2 jmol-1
zpe.correction: 0.433905 hartree
zpe.thermalcorrener: 0.469447 hartree
zpe.thermalcorrenthalpy: 0.470391 hartree
zpe.thermalcorrgfe: 0.357713 hartree
zpe.sumelectzpe: -2458.207134 hartree
zpe.sumelectthermal: -2458.171592 hartree
zpe.sumelectthermalent: -2458.170648 hartree
zpe.sumelectthermalfe: -2458.283327 hartree
dipole: -2.9432 0.0592 -4.8420
dipole: 5.6666
quadrupole: -282.7628 -218.0899 -219.3938
quadrupole: -4.4359 -3.6262 -10.6882
quadrupole: -42.6806 21.9922 20.6884 -4.4359 -3.6262 -10.6882
hfenergy: -2458.6410398 hartree
pointgroup: C01 [X(C24H23Cl1F1N5O4S1)]
dipole: 1.2138769 0.3482871 -1.8372439 debye
polarizability: 671.3035353|-46.6366834|277.1264831|6.4116304|26.6472595|278.3395235 unknown
InChI: InChI=1S/C24H23ClFN5O4S/c1-24(2)30-22(27)29-23(28)31(24)17-7-12-21(20(25)13-17)34-14-15-3-10-19(11-4-15)36(32,33)35-18-8-5-16(26)6-9-18/h3-13H,14,27-28H2,1-2H3
charge 0 multiplicity 1
59 atoms
Cl 1.899432 1.411931 2.433812
S  -5.784475 -1.429739 0.554051
F  -11.696507 1.59947 -0.597596
O  0.927632 -0.363262 0.289915
O  -6.309347 0.175274 -0.577977
O  -6.417033 -2.77449 -0.107093
O  -6.05329 -1.06893 2.116384
N  6.554372 0.421665 0.173743
N  8.836349 -0.486211 0.525657
N  8.457482 1.603532 -0.70792
N  6.307044 2.386035 -1.146587
N  10.546551 0.568002 -0.684486
C  7.491153 -0.38972 1.107448
C  6.93363 -1.815939 1.271977
C  7.561867 0.338377 2.479603
C  5.131719 0.220552 0.177982
C  7.137408 1.462436 -0.543038
C  9.237781 0.523094 -0.237716
C  4.314369 0.837385 1.166188
C  4.520384 -0.597657 -0.802454
C  2.310331 -0.210748 0.192524
C  2.929235 0.617682 1.165529
C  3.12677 -0.81357 -0.797906
C  0.257208 -1.227608 -0.683623
C  -1.225559 -1.252146 -0.357032
C  -3.951024 -1.351095 0.185321
C  -2.086699 -2.027182 -1.175722
C  -1.752883 -0.530103 0.740671
C  -3.470528 -2.082731 -0.913553
C  -3.136951 -0.571963 1.020924
C  -7.656866 0.487471 -0.549588
C  -8.156794 1.385436 0.438867
C  -8.531403 -0.060059 -1.533663
C  -9.51151 1.765467 0.42223
C  -9.886834 0.316879 -1.557276
C  -10.342716 1.221923 -0.577688
H  7.64483 -2.381208 1.896062
H  5.943347 -1.824968 1.759678
H  6.868574 -2.319047 0.292453
H  8.287191 -0.186188 3.125262
H  7.909924 1.378214 2.345439
H  6.580468 0.342339 2.988766
H  4.765694 1.482762 1.925134
H  5.149025 -1.066099 -1.565664
H  2.683065 -1.454086 -1.565308
H  6.755967 3.097377 -1.717894
H  5.304985 2.405654 -0.979816
H  0.4207 -0.835618 -1.70971
H  0.681928 -2.252268 -0.631039
H  10.817955 1.299621 -1.333919
H  11.195398 -0.156461 -0.392071
H  -1.681676 -2.592089 -2.023936
H  -1.078173 0.059519 1.365735
H  -4.149476 -2.684348 -1.525226
H  -3.563688 -0.030962 1.871032
H  -7.4698 1.77191 1.197259
H  -8.127255 -0.765183 -2.265819
H  -9.925991 2.457576 1.160457
H  -10.582793 -0.076705 -2.303281
