program: Gaussian 09
title: 000283414
version: EM64L-G09RevD.01
frameworkgroup: C1[X(C6H10N4O2)]
method: RPBEPBE
basis: SDD
operation: Freq
keyword: #p
keyword: freq=noraman
keyword: PBEPBE/SDD
title: #p freq=noraman PBEPBE/SDD
converged: YES YES NO NO
title: Mulliken charges:
elementType: O O N N N N C C C C C C H H H H H H H H H H
charge: -0.254383 -0.250941 -0.182319 -0.137109 -0.042671 -0.097957 -0.570835 0.263478 0.293570 -0.619338 -0.265660 -0.656599 0.298209 0.261987 0.230139 0.235466 0.290043 0.230199 0.267341 0.222138 0.251987 0.233256
chargesum: 0.00000
title: Mulliken charges with hydrogens summed into heavy atoms:
elementType: O O N N N N C C C C C C
charge: -0.254383 -0.250941 -0.182319 -0.137109 -0.042671 -0.097957 -0.010639 0.263478 0.293570 0.168245 0.199945 0.050782
polarizability: 1.19389406e+02 4.21382430e-02 9.19502220e+01 -9.23261039e+00 -2.01847295e+00 7.31921423e+01
1716.lowfreq: -18.2548 -6.1395 -4.9261 -0.0009 -0.0008 0.0003 5.5990 46.5082 65.2402
frequency: -2.5476 46.4419 65.1661 84.9536 108.4905 115.0438 197.8767 224.2964 232.9671 270.3867 310.2731 321.7039 390.8680 425.6949 548.9789 638.9339 658.1053 674.5908 700.3989 742.6140 803.2788 835.6092 892.5944 900.4885 923.5190 932.1138 1008.7567 1011.8343 1096.8394 1102.3394 1123.2533 1131.6176 1156.8119 1171.2431 1209.7985 1237.1845 1276.8426 1308.4767 1355.4385 1385.4432 1392.8693 1422.6601 1442.5557 1457.5160 1464.0529 1465.1913 1482.4324 1484.2419 1509.1610 1637.9759 2996.1936 2996.4856 3007.0238 3032.7615 3092.1059 3097.4930 3098.8636 3104.7769 3123.7127 3141.7027
redmass: 3.7847 3.1884 3.0737 1.3653 3.1938 4.3677 1.9737 1.8174 3.2288 2.3706 6.8288 3.9368 3.0437 3.4402 3.5995 5.8951 5.7556 8.8308 4.9139 4.2580 1.3408 3.9963 4.8504 4.1927 2.5119 5.5453 4.0121 4.7298 2.2135 4.1974 2.6986 1.3391 1.6576 2.2090 2.3592 2.6247 1.1208 1.7625 1.3280 2.5298 1.2301 1.2218 1.4030 1.0943 1.0431 1.0513 1.2303 1.0522 3.1831 8.4694 1.0395 1.0640 1.0355 1.0598 1.0976 1.1031 1.0920 1.0999 1.1065 1.1018
irintensity: 1.5845 2.7580 1.6915 1.1127 6.5021 3.7466 5.9285 1.3714 2.8583 2.4749 1.6557 13.4334 0.5179 5.3211 7.3771 4.2565 5.2624 5.3675 4.7192 10.8128 1.4381 10.7319 3.0549 6.0945 7.6541 23.7901 27.4003 42.1627 40.0277 6.1142 198.4314 1.4089 2.6804 166.5186 2.9907 7.0329 4.7942 69.7085 2.6670 25.3237 23.0836 48.9569 19.7245 13.0459 13.9606 22.8789 9.6956 12.8698 32.1911 148.2064 12.8933 8.0211 23.7667 28.2628 29.5813 1.0813 0.5332 8.4575 28.9227 0.8146
temp: 298.150 k
press: 1.00000 atm
elementType: 8 8 7 7 7 7 6 6 6 6 6 6 1 1 1 1 1 1 1 1 1 1
symmnumber: 1
zpe: 443043.2 jmol-1
zpe.correction: 0.168746 hartree
zpe.thermalcorrener: 0.180352 hartree
zpe.thermalcorrenthalpy: 0.181296 hartree
zpe.thermalcorrgfe: 0.130063 hartree
zpe.sumelectzpe: -603.119935 hartree
zpe.sumelectthermal: -603.108330 hartree
zpe.sumelectthermalent: -603.107385 hartree
zpe.sumelectthermalfe: -603.158618 hartree
dipole: -5.6016 4.1050 2.7652
dipole: 7.4750
quadrupole: -74.4571 -73.4322 -70.4044
quadrupole: 11.4111 6.3639 1.4897
quadrupole: -1.6926 -0.6676 2.3602 11.4111 6.3639 1.4897
hfenergy: -603.2886812 hartree
pointgroup: C01 [X(C6H10N4O2)]
dipole: 2.0252993 2.1275752 0.1428552 debye
dipolederiv: -1.7216042 -0.0017986 0.0793207 -0.0934177 -0.3272305 0.0439853 0.1101262 0.0269656 -0.5054742 -0.7875901 -0.0203996 -0.023523 0.0300617 -0.2947498 -0.0130295 0.3205789 -0.0172248 -0.8406503 -0.1383476 -0.1742812 -0.0152993 -0.1442494 -0.4493285 -0.1993845 0.0111171 -0.1535166 -0.1475283 -0.4025846 -0.0372731 0.0872811 -0.1606295 -0.2738461 0.0295996 0.0358148 -0.0392064 -0.2245122 -0.1156454 0.2534366 0.1166647 0.2196117 0.1396737 0.000645 0.1364182 0.0081483 -0.195559 0.0470267 0.071522 -0.1260205 0.0250272 -0.1623464 -0.0063199 -0.1238293 -0.053646 -0.0885946 -0.1729243 -0.0096537 -0.1021121 -0.018284 0.1084718 0.0131839 -0.2263296 -0.0410128 -0.1027914 0.3231519 -0.0497211 -0.1191946 0.1446489 0.2354843 0.0610029 -0.1109973 0.151218 0.1480171 1.8956016 0.0659457 -0.0557498 0.0760696 0.1946746 -0.0002585 -0.4299694 0.0352917 1.0686984 0.0677299 -0.0182357 0.0221779 -0.0151953 0.3525086 0.0821118 0.0527337 0.0894121 0.2067434 0.8257868 -0.0458482 0.0840275 -0.0028374 0.332208 -0.0583984 0.3251463 -0.0154867 0.2907141 -0.0914888 0.0360991 -0.0211076 0.028026 -0.1173998 0.0768567 -0.0945443 0.0385955 0.0249909 0.0668942 0.0038982 0.0193003 0.0176424 0.0909753 -0.0762026 0.0480594 -0.0303138 0.0730771 0.0163928 0.005636 -0.0220597 -0.0291053 -0.0376985 0.0621465 0.0113088 0.0226252 0.1190127 -0.0697442 -0.059845 0.0350527 -0.0601282 0.0134373 0.0690647 0.0427492 0.1036961 0.0137488 0.0107195 0.074153 0.040558 0.0270847 -0.0064091 -0.0623786 -0.0721374 -0.0992691 -0.0237491 0.0853743 -0.0296237 -0.113473 -0.0065528 0.0524142 -0.0001097 -0.0850432 -0.0322472 0.0758161 0.1279956 -0.0296152 0.0076873 -0.0114015 -0.0827085 0.0222442 -0.0113928 0.1060559 -0.0181194 -0.0048013 0.0328645 0.105269 -0.0377115 0.1023926 -0.0010403 0.0517442 -0.0376814 0.083907 -0.1048305 -0.0076877 -0.1136871 0.0136378 0.0886864 -0.0177018 -0.1342838 -0.0085066 0.056397 0.0218998 -0.0804934 0.0960166 -0.0413537 0.0345817 0.0424154 0.0901842 0.0558756 0.0437835 0.1209878 0.020921 0.0188711 0.0390562 0.0062088 -0.0684323 0.052546 -0.1097726 -0.0579275 unknown
polarizability: 118.4818949|8.3704766|84.4409358|-7.4718703|9.0653185|81.60894 unknown
InChI: InChI=1S/C6H10N4O2/c1-3-12-6(11)4-5-7-8-9-10(5)2/h3-4H2,1-2H3
charge 0 multiplicity 1
22 atoms
O  2.585792 0.669793 -0.957721
O  1.211604 0.565065 0.92569
N  -1.876083 0.400526 0.097027
N  -1.543438 -1.293583 -1.306177
N  -2.967335 -0.478182 0.257073
N  -2.747041 -1.494241 -0.601106
C  0.243483 0.486231 -1.361827
C  -1.027845 -0.117194 -0.851994
C  1.361513 0.562802 -0.318005
C  -1.79385 1.619333 0.908027
C  3.803023 0.763719 -0.081192
C  4.292703 -0.633398 0.304399
H  0.590022 -0.117864 -2.215003
H  0.075385 1.511819 -1.746916
H  4.527424 1.302355 -0.711835
H  3.545665 1.364308 0.808764
H  -0.89551 1.58231 1.54354
H  -1.756206 2.513282 0.261294
H  -2.699283 1.662146 1.530236
H  5.234323 -0.549084 0.877731
H  3.551796 -1.150984 0.936138
H  4.489155 -1.244758 -0.592745
