program: Gaussian 09
title: 000283401
version: EM64L-G09RevD.01
frameworkgroup: C1[X(C3H6N4)]
method: RPBEPBE
basis: SDD
operation: Freq
keyword: #p
keyword: freq=noraman
keyword: PBEPBE/SDD
title: #p freq=noraman PBEPBE/SDD
converged: YES YES NO NO
title: Mulliken charges:
elementType: N N N N C C C H H H H H H
charge: -0.397920 -0.360345 -0.143373 -0.520575 0.191816 -0.209179 -0.276422 0.305148 0.256910 0.303945 0.248767 0.298036 0.303194
chargesum: 0.00000
title: Mulliken charges with hydrogens summed into heavy atoms:
elementType: N N N N C C C
charge: -0.092772 -0.056400 -0.143373 0.080655 0.191816 0.047731 -0.027655
polarizability: 7.85176194e+01 1.18052267e+00 6.06382593e+01 -8.14949215e-01 9.44828269e-02 3.03971294e+01
1716.lowfreq: -12.9660 -10.7412 -0.0007 -0.0006 -0.0003 3.1700 92.1559 166.0580 216.0943
frequency: 92.0553 166.0355 216.0886 327.2988 462.3458 522.0609 569.5895 609.4158 672.2415 702.6528 745.9882 827.4375 829.0809 896.2774 961.6521 1070.6445 1087.7947 1168.6388 1175.6988 1258.1769 1294.8625 1325.2610 1355.4816 1465.0156 1497.6451 1562.6243 1688.9639 3228.0319 3258.1241 3374.2096 3499.3526 3530.1580 3594.5805
redmass: 2.4582 1.7705 2.7105 3.3935 2.6726 1.6983 1.2369 3.1625 2.0038 2.0590 2.4577 2.1227 1.3813 6.6800 3.2674 1.5345 2.1345 2.5589 2.5107 1.9728 1.2688 2.3640 1.9810 1.6807 3.9407 5.6993 1.0592 1.0911 1.1093 1.0450 1.0961 1.0776 1.0814
irintensity: 10.3063 18.7318 7.0797 10.5947 43.1238 181.6286 148.2926 5.5452 47.6716 81.5500 52.0917 109.3836 16.5309 10.4905 3.1695 22.9979 10.5666 32.1844 31.6945 8.1166 0.5043 4.4664 6.8019 26.0998 3.2117 276.7974 29.6927 3.3677 5.4096 2.8559 2.0506 18.8575 30.9962
temp: 298.150 k
press: 1.00000 atm
elementType: 7 7 7 7 6 6 6 1 1 1 1 1 1
symmnumber: 1
zpe: 269372.0 jmol-1
zpe.correction: 0.102598 hartree
zpe.thermalcorrener: 0.109236 hartree
zpe.thermalcorrenthalpy: 0.110180 hartree
zpe.thermalcorrgfe: 0.072058 hartree
zpe.sumelectzpe: -336.344490 hartree
zpe.sumelectthermal: -336.337852 hartree
zpe.sumelectthermalent: -336.336908 hartree
zpe.sumelectthermalfe: -336.375030 hartree
dipole: 1.0643 3.0291 -0.0789
dipole: 3.2116
quadrupole: -40.7329 -35.1662 -43.0552
quadrupole: 2.6897 -0.5949 -1.2090
quadrupole: -1.0815 4.4852 -3.4037 2.6897 -0.5949 -1.2090
hfenergy: -336.4470885 hartree
pointgroup: C01 [X(C3H6N4)]
dipole: 0.4321929 -1.1558524 0.2716407 debye
dipolederiv: -0.3810147 -0.1443363 0.0411716 0.1488209 -0.5109629 0.0853845 -0.08408 0.1018849 -0.2990991 -0.957354 -0.1603802 0.018538 -0.5929252 -0.2900599 -0.1725837 -0.0595065 -0.2967736 -0.2060393 -0.6187627 0.0680221 0.0234888 -0.3403667 -0.5497664 0.0853642 0.1767759 0.0779948 -0.3079459 -0.3616669 -0.1334222 0.1519529 -0.2392498 -0.0889206 0.0918117 0.2915567 0.0303405 -0.1564272 1.2484186 0.1100129 -0.1047315 0.4812811 0.5377371 -0.0868939 -0.2204698 -0.0489586 0.132552 -0.1624124 0.2319042 -0.0613115 0.1259731 0.1541447 -0.1213339 -0.0330086 -0.1330493 -0.2157471 0.3284527 -0.0021145 -0.050924 0.0438581 0.100209 -0.0704834 -0.0439301 -0.080625 -0.1704905 0.1880974 -0.0018936 0.0189863 -0.0188735 0.1468453 0.0414931 0.0290625 0.0279952 0.3612458 -0.0146566 0.0527401 0.0173472 0.0806022 0.0790991 0.0322334 0.0052845 0.0409356 0.2382302 0.1316948 0.0936793 -0.0066332 0.1963997 0.2118229 0.0878832 0.1255496 0.1887761 0.1940903 0.0337006 -0.0573257 0.0299641 -0.101198 0.0242606 0.0499693 0.0344108 0.048561 0.1797111 0.317546 0.0400959 0.0313061 0.1562616 0.1498429 0.0261132 -0.080989 0.0261615 0.0102053 0.2479574 -0.096982 -0.1091549 0.0594165 0.0357484 -0.0489577 -0.1406561 0.016757 0.2397144 unknown
polarizability: 78.2455281|-1.8634589|59.0168086|-3.5009979|-6.7320567|32.2906715 unknown
InChI: InChI=1S/C3H6N4/c4-7-3-5-1-2-6-3/h1-2,5,7H,4H2
charge 0 multiplicity 1
13 atoms
N  0.722942 -1.239623 0.202942
N  -1.686763 -0.764615 0.335651
N  0.032368 0.883809 -0.200095
N  -2.719904 0.213042 0.214726
C  -0.359415 -0.365263 0.127814
C  1.885018 -0.49024 -0.09505
C  1.434604 0.801981 -0.34438
H  0.687686 -2.243745 0.369073
H  2.876328 -0.934486 -0.096008
H  -1.879829 -1.464925 1.053874
H  2.017677 1.680306 -0.609713
H  -2.983657 0.310864 -0.774639
H  -2.401756 1.122696 0.586906
