program: Gaussian 09
title: 000286320
version: EM64L-G09RevD.01
frameworkgroup: C1[X(C11H11NO4)]
method: RPBEPBE
basis: SDD
operation: Freq
keyword: #p
keyword: freq=noraman
keyword: PBEPBE/SDD
title: #p freq=noraman PBEPBE/SDD
converged: YES YES NO NO
title: Mulliken charges:
elementType: O O O O N C C C C C C C C C C C H H H H H H H H H H H
charge: -0.308571 -0.226744 -0.421721 -0.224201 -0.459584 0.355062 -0.447077 -0.319040 -0.384317 0.201959 -0.225549 -0.192243 -0.253659 0.438854 0.138561 -0.653182 0.251584 0.270063 0.264791 0.255854 0.229034 0.231349 0.353414 0.231880 0.241358 0.265415 0.386710
chargesum: 0.00000
title: Mulliken charges with hydrogens summed into heavy atoms:
elementType: O O O O N C C C C C C C C C C C
charge: -0.308571 -0.226744 -0.035010 -0.224201 -0.106169 0.355062 0.074569 -0.054249 -0.128463 0.201959 0.003485 0.039106 -0.021779 0.438854 0.138561 -0.146410
polarizability: 1.60489455e+02 6.37035513e+00 1.22198048e+02 -5.34031233e+00 1.05962547e+01 1.25041757e+02
1716.lowfreq: -6.5478 -0.0005 0.0004 0.0006 5.2720 12.1474 29.4225 35.4055 39.4445
frequency: 29.2414 35.3711 39.3817 59.9684 87.3982 115.5132 150.1993 177.7698 222.8019 260.4391 287.3897 323.1064 361.1018 363.7644 410.5595 492.7414 500.6537 514.1771 522.0273 557.3238 574.3485 608.1816 613.3238 641.5176 657.4081 692.6023 696.0517 747.4643 756.2442 761.6368 782.3044 828.1491 899.2639 907.8786 956.5152 964.7211 980.7118 987.0157 988.8657 1001.3632 1008.1386 1024.9226 1045.4950 1085.2458 1166.4023 1177.3544 1190.0986 1196.0043 1234.1163 1250.3422 1315.1981 1327.2518 1367.5332 1385.6951 1402.6676 1439.2211 1446.1720 1469.6656 1483.8011 1594.8920 1609.1197 1629.7496 1644.9789 1654.6551 3016.7102 3088.0601 3121.1975 3132.3128 3141.1553 3156.3565 3164.6870 3174.3668 3238.7606 3496.0378 3532.1836
redmass: 6.8418 4.6716 4.2779 8.9249 7.0406 5.4767 6.5884 5.3350 3.6258 4.5516 4.7145 4.8251 3.4146 4.5845 2.9091 3.4720 3.5426 3.2980 3.8685 4.9309 2.3939 2.0829 5.9048 3.8962 1.1497 2.1234 2.4045 2.4179 3.8829 1.8049 2.8461 1.2483 1.4225 3.2313 1.4897 1.3849 5.1561 1.3205 4.9048 2.6072 2.3310 2.0556 2.7985 1.5317 1.2171 1.5390 1.4693 2.1971 1.2726 1.8819 1.3258 1.2668 4.0581 8.4482 1.2743 1.4463 1.5041 1.9333 2.0513 6.2441 6.4559 8.7270 6.9102 7.2625 1.0588 1.1047 1.0628 1.0849 1.0890 1.0927 1.0961 1.1011 1.1157 1.0768 1.0643
irintensity: 0.9467 1.7715 0.1841 0.8313 1.2444 2.9045 7.2736 3.6605 4.9085 3.8523 9.7019 2.2940 10.4335 7.0124 0.0451 24.7054 13.1887 20.8620 21.4805 4.0200 36.0048 52.0900 2.5448 3.6556 107.7652 39.8256 10.3097 24.5830 27.9806 90.0762 4.1360 0.0242 9.2729 0.6213 91.9399 0.0420 21.5842 1.4169 14.7728 10.4346 0.8769 17.6162 227.1774 12.6035 40.6761 100.5022 18.2353 27.8072 69.3510 45.5094 1.2684 8.8613 175.1297 4.4907 76.9597 14.0939 18.5107 154.7649 116.6397 23.8095 60.4784 204.9303 234.2357 58.5141 19.0152 5.4758 3.8875 0.9272 10.9025 22.3866 12.9056 8.1142 1.4911 63.6316 40.4680
temp: 298.150 k
press: 1.00000 atm
elementType: 8 8 8 8 7 6 6 6 6 6 6 6 6 6 6 6 1 1 1 1 1 1 1 1 1 1 1
symmnumber: 1
zpe: 532141.1 jmol-1
zpe.correction: 0.202682 hartree
zpe.thermalcorrener: 0.217584 hartree
zpe.thermalcorrenthalpy: 0.218529 hartree
zpe.thermalcorrgfe: 0.158656 hartree
zpe.sumelectzpe: -780.235166 hartree
zpe.sumelectthermal: -780.220264 hartree
zpe.sumelectthermalent: -780.219319 hartree
zpe.sumelectthermalfe: -780.279192 hartree
dipole: -3.6231 -0.6060 1.7606
dipole: 4.0735
quadrupole: -105.2662 -86.8740 -86.9787
quadrupole: 1.2357 4.0740 7.1573
quadrupole: -12.2265 6.1656 6.0609 1.2357 4.0740 7.1573
hfenergy: -780.4378479 hartree
pointgroup: C01 [X(C11H11N1O4)]
dipole: 1.22322 -0.7919369 -0.6671441 debye
polarizability: 156.2197364|-14.3993379|116.1642412|-5.1302847|1.23026|135.3452817 unknown
InChI: InChI=1S/C11H11NO4/c1-8(11(14)15)12-10(13)7-16-9-5-3-2-4-6-9/h2-6,12,14H,1,7H2
charge 0 multiplicity 1
27 atoms
O  1.119258 1.496512 -1.294608
O  -1.582142 2.656452 0.934927
O  -1.756748 0.007841 2.120014
O  -4.059897 -0.088525 1.801499
N  -1.384224 0.815593 -0.508021
C  1.964475 0.535059 -0.672843
C  0.434386 2.467998 -0.431498
C  1.851536 0.147321 0.68339
C  2.931036 -0.050874 -1.52181
C  -0.935687 1.991044 0.080114
C  2.738527 -0.833472 1.186513
C  3.80137 -1.032964 -1.00493
C  3.713403 -1.425274 0.352907
C  -2.583289 0.15236 -0.136121
C  -2.910834 0.044361 1.328246
C  -3.399132 -0.461724 -1.034652
H  1.054953 2.751749 0.438264
H  0.280974 3.361239 -1.060902
H  1.076217 0.562223 1.3352
H  2.989981 0.27782 -2.563976
H  2.653737 -1.140027 2.234899
H  4.553309 -1.485439 -1.660676
H  -0.809486 0.436541 -1.268106
H  4.393692 -2.184259 0.752975
H  -3.208059 -0.419164 -2.111747
H  -4.275235 -1.012294 -0.683995
H  -2.026621 -0.018299 3.076938
