program: Gaussian 09
title: 000286327
version: EM64L-G09RevD.01
frameworkgroup: C1[X(C19H14N2O7S)]
method: RPBEPBE
basis: SDD
operation: Freq
keyword: #p
keyword: freq=noraman
keyword: PBEPBE/SDD
title: #p freq=noraman PBEPBE/SDD
converged: YES YES NO NO
title: Mulliken charges:
elementType: S O O O O O O O N N C C C C C C C C C C C C C C C C C C C H H H H H H H H H H H H H H
charge: 0.939495 -0.546611 -0.546651 -0.173484 -0.200530 -0.200527 -0.196039 -0.196033 0.028756 0.028764 -0.835268 -0.835071 0.373452 0.372887 -0.092680 -0.367112 -0.367411 0.412190 0.412225 -0.359616 -0.359629 -0.369362 -0.369435 -0.367509 -0.367504 -0.377603 -0.377606 0.373175 0.373138 0.328906 0.322148 0.328875 0.322158 0.276358 0.276431 0.255944 0.255947 0.321279 0.321386 0.292984 0.292978 0.298098 0.298106
chargesum: 0.00000
title: Mulliken charges with hydrogens summed into heavy atoms:
elementType: S O O O O O O O N N C C C C C C C C C C C C C C C C C C C
charge: 0.939495 -0.546611 -0.546651 -0.173484 -0.200530 -0.200527 -0.196039 -0.196033 0.028756 0.028764 -0.184213 -0.184038 0.373452 0.372887 -0.092680 -0.090754 -0.090980 0.412190 0.412225 -0.103672 -0.103682 -0.048083 -0.048048 -0.074525 -0.074526 -0.079505 -0.079500 0.373175 0.373138
polarizability: 6.45983572e+02 1.08931233e-02 2.82179270e+02 -1.79372466e+00 -1.22157602e-02 1.28176174e+02
1716.lowfreq: -0.0018 0.0006 0.0010 2.5410 5.0143 8.9749 14.4481 28.9065 37.3661
frequency: 14.3157 28.9049 37.3659 44.0298 45.4859 62.3073 67.2297 74.7090 79.6121 115.1598 120.7171 133.5378 136.0329 146.6928 181.2641 188.1339 207.5021 223.5945 229.8940 254.9167 256.6912 292.6413 311.9102 328.2885 343.3246 351.0921 358.0624 392.8307 406.4222 414.6321 417.5831 417.7275 448.1565 487.0681 496.8167 503.2984 509.1640 521.9865 570.6828 621.3505 622.8590 628.1180 634.1603 666.4153 669.2389 681.6336 688.7857 728.9971 733.4254 757.8549 761.0041 774.2679 780.0647 800.9479 820.4977 830.3886 848.0112 856.2241 858.2105 888.5136 891.8042 899.2283 930.7714 933.3318 947.9719 977.3194 993.8056 993.9140 1002.1387 1002.2069 1028.0362 1028.8101 1077.3115 1085.7248 1091.7386 1091.8207 1118.4690 1119.8211 1164.4844 1188.5159 1193.0660 1193.3994 1205.0404 1205.2134 1220.9307 1222.3616 1235.8210 1271.5556 1316.6777 1316.7557 1344.6552 1345.8412 1370.5956 1371.4650 1398.5524 1399.1527 1417.5135 1417.9406 1436.4316 1440.7071 1483.5188 1483.9849 1562.0755 1582.7511 1583.5564 1603.2653 1603.6203 1609.1545 1629.1017 3055.7477 3056.2939 3091.8509 3092.2192 3107.9642 3108.4560 3144.9778 3144.9910 3155.0993 3155.1829 3182.6845 3182.7011 3186.3880 3186.3928
redmass: 11.6550 10.1589 8.6853 12.2406 8.6574 9.7872 9.5122 5.0945 6.2647 6.9990 9.2961 8.2054 8.4906 8.8506 8.0337 9.8056 7.8925 9.1259 9.3157 7.2024 5.2259 6.1063 6.1458 2.6402 3.6539 4.5981 6.9132 6.1030 4.7359 8.3212 3.0119 3.1040 7.4109 5.7786 4.1217 3.8508 6.2395 4.1415 6.6441 6.7503 6.7000 7.1347 7.7380 5.4065 4.8481 4.4376 5.2843 4.0855 3.9894 4.8006 6.0752 6.8167 6.6759 6.8535 4.8608 3.7449 2.0116 1.5434 1.6220 1.3748 1.4304 1.7403 1.5632 1.7965 3.4324 3.8124 1.3679 1.3725 3.1347 3.0517 1.3004 1.3019 1.5296 1.3317 3.0795 3.0300 1.3709 1.3695 1.7335 1.4042 1.9253 1.8313 1.6425 1.2259 2.6963 2.8052 2.3587 3.5559 1.3953 1.3940 2.2756 2.4087 4.3867 4.2692 5.6356 5.3052 2.8211 2.8482 1.2173 1.1975 2.2785 2.2953 11.4521 7.2959 7.2926 5.8614 5.8601 6.9504 7.9140 1.0587 1.0582 1.0883 1.0884 1.0953 1.0952 1.0909 1.0909 1.1091 1.1096 1.0937 1.0937 1.0953 1.0953
irintensity: 0.0957 0.7239 0.0002 0.1355 0.0014 7.7949 0.3597 0.2614 2.6497 11.2055 0.6206 2.5863 5.5745 1.6167 1.8519 2.8672 8.8920 2.2123 27.7789 3.0629 1.4062 3.7547 0.9608 5.6252 0.6512 6.3560 15.2491 0.9091 38.9507 7.2801 2.8527 0.0685 13.3103 1.5997 1.0466 79.4790 5.5631 5.1842 2.4942 4.2622 1.2110 34.9578 2.6318 0.5185 44.8173 0.2857 11.2687 5.2887 0.5773 5.9989 8.5158 125.1841 13.6895 51.2784 7.1715 0.0002 0.9747 1.1992 42.0411 1.0574 71.7374 9.4147 0.0133 71.4862 148.2474 59.3569 0.0080 2.5282 0.1554 13.0162 0.1377 0.9990 2.2125 109.9778 58.0423 5.5574 26.2819 1.9888 0.7090 28.3076 328.9579 39.1913 307.1500 6.1534 424.6405 40.4259 1.0325 72.7777 3.1902 0.8318 8.3232 8.0317 50.3889 136.4361 1.4572 13.2587 16.1241 66.1420 21.6769 12.7059 1.5146 13.4664 121.8321 17.0361 7.5537 34.2656 0.6655 235.9308 13.6046 0.9241 3.8739 0.4735 0.0025 39.6501 1.1584 0.6187 8.0112 0.6862 0.0043 1.7772 3.0815 2.9054 1.0539
temp: 298.150 k
press: 1.00000 atm
elementType: 16 8 8 8 8 8 8 8 7 7 6 6 6 6 6 6 6 6 6 6 6 6 6 6 6 6 6 6 6 1 1 1 1 1 1 1 1 1 1 1 1 1 1
symmnumber: 1
zpe: 782080.4 jmol-1
zpe.correction: 0.297879 hartree
zpe.thermalcorrener: 0.323730 hartree
zpe.thermalcorrenthalpy: 0.324675 hartree
zpe.thermalcorrgfe: 0.239419 hartree
zpe.sumelectzpe: -1764.160273 hartree
zpe.sumelectthermal: -1764.134421 hartree
zpe.sumelectthermalent: -1764.133477 hartree
zpe.sumelectthermalfe: -1764.218733 hartree
dipole: -0.0005 6.6476 0.0045
dipole: 6.6476
quadrupole: -264.3424 -190.8704 -172.7608
quadrupole: 0.0016 2.6020 0.0110
quadrupole: -55.0178 18.4541 36.5638 0.0016 2.6020 0.0110
hfenergy: -1764.4581517 hartree
pointgroup: C01 [X(C19H14N2O7S1)]
dipole: 0.0002209 2.6153669 -0.0036903 debye
polarizability: 645.892604|-0.0058922|282.1792031|7.0931585|-0.1019527|128.2672076 unknown
InChI: InChI=1S/C19H14N2O7S/c22-19-15(9-13-1-5-17(6-2-13)20(23)24)11-29(27,28)12-16(19)10-14-3-7-18(8-4-14)21(25)26/h1-10H,11-12H2
charge 0 multiplicity 1
43 atoms
S  -0.000413 -1.504072 -0.001768
O  1.103639 -2.306666 -0.906246
O  -1.104398 -2.306217 0.903189
O  -0.000314 3.162704 -0.002157
O  8.667764 -0.208133 0.346026
O  -8.667838 -0.208702 -0.339229
O  7.722609 -2.263058 0.038443
O  -7.722253 -2.26307 -0.029585
N  7.649703 -0.980915 0.162827
N  -7.649518 -0.981168 -0.156301
C  0.96479 -0.161703 1.124178
C  -0.965911 -0.16253 -1.128372
C  1.222814 1.068593 0.323418
C  -1.222916 1.068422 -0.328357
C  0.00022 1.899251 -0.003739
C  2.45623 1.519338 -0.093882
C  -2.455771 1.519597 0.090145
C  3.758284 0.840439 -0.026261
C  -3.757903 0.840582 0.02506
C  4.927977 1.638539 0.152499
C  -4.927851 1.638383 -0.153352
C  3.902564 -0.572299 -0.188173
C  -3.901936 -0.571919 0.189232
C  6.201831 1.051453 0.228375
C  -6.201782 1.051147 -0.226733
C  5.175399 -1.168724 -0.126388
C  -5.174833 -1.168467 0.129985
C  6.304642 -0.350777 0.09373
C  -6.304397 -0.35089 -0.089885
H  1.854859 -0.695288 1.482649
H  0.223096 -0.017663 1.925486
H  -1.856377 -0.696185 -1.48575
H  -0.224741 -0.019336 -1.930316
H  2.460849 2.535101 -0.518583
H  -2.459844 2.535801 0.513794
H  4.827448 2.725107 0.250681
H  -4.827479 2.724809 -0.253251
H  3.033954 -1.199358 -0.427145
H  -3.033005 -1.198595 0.428046
H  7.105876 1.646303 0.380315
H  -7.106036 1.64575 -0.378398
H  5.30686 -2.245721 -0.259443
H  -5.306089 -2.245264 0.264832
