program: Gaussian 09
title: 000286336
version: EM64L-G09RevD.01
frameworkgroup: C1[X(C23H24O6)]
method: RPBEPBE
basis: SDD
operation: Freq
keyword: #pfreq=noraman
keyword: PBEPBE/SDD
title: #p freq=noraman PBEPBE/SDD
converged: YES YES NO NO
title: Mulliken charges:
elementType: O O O O O O C C C C C C C C C C C C C C C C C C C C C C C H H H H H H H H H H H H H H H H H H H H H H H H
charge: -0.235842 -0.247313 -0.304726 -0.304727 -0.292711 -0.292694 0.235948 0.236421 -0.468940 -0.469268 -0.044088 -0.392829 -0.392902 0.493462 0.493116 -0.488119 -0.488190 -0.416731 -0.416540 0.197345 0.197330 0.188777 0.188772 -0.358143 -0.358116 -0.530808 -0.530827 -0.529526 -0.529553 0.192496 0.267566 0.267653 0.192470 0.275174 0.275159 0.267452 0.267528 0.244507 0.244532 0.254613 0.254619 0.233418 0.250973 0.225498 0.225521 0.250974 0.233422 0.259085 0.227525 0.232286 0.227536 0.259128 0.232285
chargesum: 0.00000
title: Mulliken charges with hydrogens summed into heavy atoms:
elementType: O O O O O O C C C C C C C C C C C C C C C C C C C C C C C
charge: -0.235842 -0.247313 -0.304726 -0.304727 -0.292711 -0.292694 0.235948 0.236421 -0.008878 -0.009145 -0.044088 -0.117655 -0.117743 0.493462 0.493116 -0.220667 -0.220662 -0.172224 -0.172008 0.197345 0.197330 0.188777 0.188772 -0.103530 -0.103497 0.179081 0.179090 0.189370 0.189397
polarizability: 6.81175593e+02 2.12355505e-03 2.68762359e+02 9.76679378e-02 5.56275507e+00 1.48359502e+02
1716.lowfreq: -10.9693 -5.8844 -0.0013 -0.0003 0.0017 3.1550 6.8630 11.4224 23.9840
frequency: 4.5424 9.1273 23.9839 40.0793 49.3027 62.3907 73.0755 89.8491 91.2193 107.9991 112.6829 115.8083 129.8540 142.0701 144.2428 145.2278 151.2297 162.0004 162.5905 175.1298 186.2174 223.6657 233.3604 236.9359 253.0155 265.4129 266.1680 297.3361 300.7961 351.2731 352.4309 382.8979 383.3285 406.7575 425.8999 454.6018 469.1187 476.6864 490.6532 493.9611 506.4498 532.8528 539.3634 567.3892 577.0322 626.1187 632.2627 655.5501 656.1736 707.9033 709.3398 728.3290 736.1745 741.4410 753.0846 758.2751 764.3586 834.4446 837.3145 874.0419 888.6752 894.8342 899.2002 908.8859 941.6207 945.5047 946.8291 955.5382 959.6178 970.3112 977.8223 983.6922 987.6727 999.6524 1022.2781 1055.6820 1093.1224 1096.5135 1112.7970 1113.1372 1114.0248 1114.1620 1143.0665 1143.4970 1146.1789 1154.3979 1154.9792 1157.3234 1158.9717 1192.8550 1205.0048 1212.6990 1222.6332 1252.1021 1253.8194 1260.8578 1276.4969 1280.6134 1336.4155 1346.9475 1349.0061 1353.9481 1379.1096 1386.8170 1407.3014 1408.2660 1424.7935 1424.9227 1441.4554 1442.0871 1449.5073 1455.0062 1456.9236 1456.9621 1459.6501 1459.6919 1475.6791 1475.7159 1483.2710 1484.6300 1488.0903 1488.1888 1501.4776 1552.1318 1552.4446 1600.8742 1606.4339 1613.4008 1640.4658 2893.3249 2893.5572 2972.4522 2972.5642 2978.8014 2978.9618 3061.6011 3064.5096 3067.9340 3068.0548 3077.4389 3077.4684 3085.3814 3086.2023 3123.1609 3123.2030 3127.5176 3127.5488 3138.6891 3138.7253 3166.5845 3166.6394 3177.6090 3177.9577
redmass: 4.2640 5.5108 5.6867 4.0848 5.7264 4.2609 4.3529 3.8436 3.5409 3.5370 3.1568 2.7060 3.9832 3.3704 1.1800 1.1961 2.3368 1.1361 1.1374 3.9526 3.5356 6.3004 4.5557 4.7707 7.4865 6.4863 6.4427 5.3241 3.3031 4.5214 4.5232 3.0669 4.5261 5.4128 5.2565 3.5490 3.4457 4.8301 3.6173 3.5751 6.5710 6.4998 4.8954 5.1881 4.8515 4.2440 3.5153 4.9363 5.4078 6.0500 5.5661 4.9847 5.4070 3.9848 3.7041 4.1647 5.0380 1.4572 1.4954 4.7648 2.4486 1.6142 2.8963 3.7694 6.7868 7.7487 1.6329 1.4105 3.9884 1.5569 1.4883 3.7501 1.6872 2.6143 1.9969 7.4040 2.8252 2.7609 1.2413 1.2417 1.2495 1.2472 2.1095 1.5384 1.6206 1.3260 1.3544 1.6576 1.6635 1.9040 1.1270 1.8594 2.4226 2.6602 1.5590 1.8024 1.1576 2.8264 1.6054 1.4047 3.3395 3.4996 2.4542 2.4373 2.1958 2.0314 1.1819 1.1832 1.4050 1.4335 1.1042 1.1039 1.0547 1.0551 1.0733 1.0728 1.0755 1.0781 2.9059 2.5637 1.0605 1.0585 7.6863 7.0842 7.0879 6.9245 6.5245 7.1285 8.6420 1.0699 1.0686 1.0307 1.0307 1.0308 1.0308 1.0904 1.0928 1.1045 1.1045 1.1041 1.1041 1.0874 1.0876 1.1025 1.1025 1.1033 1.1033 1.0888 1.0888 1.0959 1.0959 1.0913 1.0913
irintensity: 0.0486 0.7650 0.3864 0.0008 0.0142 2.1565 0.1370 0.2335 6.7363 9.2073 2.6926 16.4887 1.4905 3.0567 0.0942 0.5155 0.0003 0.1719 0.0921 6.4887 1.6745 0.1699 5.4523 26.8200 1.5530 13.4844 10.0049 0.0146 1.2494 1.4140 2.4130 0.7840 0.0879 2.3261 18.1560 16.4550 3.8709 0.9014 11.9040 8.6260 111.2510 0.8329 10.7293 14.1360 25.1017 21.7093 30.3190 3.6039 14.3135 23.3212 3.9158 11.7996 1.2496 8.4759 0.2199 7.0449 3.9330 2.4895 56.5354 18.6964 2.2324 12.1249 69.6180 10.8405 114.9589 59.0254 2.4610 20.8571 11.8729 11.0641 28.9117 82.7320 3.3740 153.0523 2.9751 48.9449 85.9115 43.0416 75.6175 15.5140 11.5524 5.9883 4.5975 0.0434 3.7430 10.4424 3.0648 31.9409 23.4604 582.9832 3.9997 27.5937 810.7246 80.2549 66.1822 17.7469 4.8106 22.1610 107.5128 0.3646 52.4424 39.6764 77.2743 0.1370 15.6497 27.1700 1.9619 6.2385 90.0788 29.5814 6.5515 0.0934 14.4592 16.2258 5.7328 14.2841 25.9189 10.2525 154.0262 441.2652 14.3615 12.7657 44.6315 4.8896 18.2359 518.1745 6.0687 178.2924 1.9105 29.6159 84.3002 36.0603 112.6142 129.3088 70.9664 21.6617 8.1318 30.6516 26.0276 19.5044 25.7380 0.9328 0.5712 12.2280 33.8633 43.1182 11.1987 3.8939 5.2625 14.9566 11.2046 0.8985 1.6131
temp: 298.150 k
press: 1.00000 atm
elementType: 8 8 8 8 8 8 6 6 6 6 6 6 6 6 6 6 6 6 6 6 6 6 6 6 6 6 6 6 6 1 1 1 1 1 1 1 1 1 1 1 1 1 1 1 1 1 1 1 1 1 1 1 1
symmnumber: 1
zpe: 1094735.0 jmol-1
zpe.correction: 0.416963 hartree
zpe.thermalcorrener: 0.445958 hartree
zpe.thermalcorrenthalpy: 0.446902 hartree
zpe.thermalcorrgfe: 0.353075 hartree
zpe.sumelectzpe: -1339.956455 hartree
zpe.sumelectthermal: -1339.927460 hartree
zpe.sumelectthermalent: -1339.926516 hartree
zpe.sumelectthermalfe: -1340.020343 hartree
dipole: -0.0010 3.7213 -0.9691
dipole: 3.8455
quadrupole: -114.7458 -165.5134 -172.2117
quadrupole: 0.0207 -0.0284 -9.2714
quadrupole: 36.0778 -14.6898 -21.3881 0.0207 -0.0284 -9.2714
hfenergy: -1340.3734178 hartree
pointgroup: C01 [X(C23H24O6)]
dipole: 0.0016996 -1.4795629 -0.3159255 debye
polarizability: 681.1752379|0.3665144|268.0324232|-0.1494811|-10.878394|149.0897929 unknown
InChI: InChI=1S/C23H24O6/c1-25-19-7-5-15(11-21(19)27-3)9-17-13-29-14-18(23(17)24)10-16-6-8-20(26-2)22(12-16)28-4/h5-12H,13-14H2,1-4H3
charge 0 multiplicity 1
53 atoms
O  0.000051 -0.717236 1.448363
O  -0.002016 2.674566 -0.784506
O  5.959062 -2.117239 -0.06933
O  -5.954027 -2.128029 -0.076582
O  8.002304 -0.004134 -0.094822
O  -8.00146 -0.018682 -0.088363
C  1.28695 0.757198 -0.051659
C  -1.288178 0.755306 -0.051758
C  1.204728 -0.60495 0.618093
C  -1.203556 -0.607582 0.616097
C  -0.001158 1.485411 -0.31484
C  2.451588 1.402487 -0.40052
C  -2.453995 1.399631 -0.398368
C  3.845756 0.961612 -0.324105
C  -3.847284 0.956096 -0.321349
C  4.262702 -0.39941 -0.218647
C  -4.2613 -0.406173 -0.220939
C  4.865512 1.959729 -0.408184
C  -4.869103 1.952558 -0.399528
C  5.624752 -0.743802 -0.159734
C  -5.622562 -0.753525 -0.16114
C  6.624111 0.275929 -0.162076
C  -6.623921 0.264258 -0.157107
C  6.226992 1.62417 -0.314959
C  -6.229741 1.613919 -0.305106
C  6.704685 -2.64283 -1.238325
C  -6.700959 -2.649418 -1.246619
C  8.44858 -0.749242 1.108729
C  -8.44376 -0.770977 1.112212
H  1.209355 -1.429935 -0.133851
H  2.048241 -0.760024 1.311171
H  -2.04788 -0.765991 1.307413
H  -1.204391 -1.431618 -0.136886
H  2.296687 2.422183 -0.785393
H  -2.301082 2.42029 -0.781477
H  3.546891 -1.224677 -0.240939
H  -3.543748 -1.229814 -0.248173
H  4.57262 3.00944 -0.522117
H  -4.578473 3.0033 -0.509684
H  7.007397 2.390619 -0.347681
H  -7.011726 2.378941 -0.333117
H  6.9132 -3.697238 -1.002255
H  7.647188 -2.086618 -1.392433
H  6.07876 -2.576488 -2.148149
H  -6.076955 -2.577559 -2.157341
H  -7.644794 -2.094226 -1.396211
H  -6.907071 -3.705322 -1.015181
H  7.896346 -1.698928 1.216626
H  8.30162 -0.124688 2.00947
H  9.521423 -0.935773 0.951594
H  -8.296172 -0.150815 2.015878
H  -7.889341 -1.720056 1.214002
H  -9.516549 -0.958843 0.95631
