program: Gaussian 09
title: 000286287
version: EM64L-G09RevD.01
frameworkgroup: C1[X(C8H12F3NO6)]
method: RPBEPBE
basis: SDD
operation: Freq
keyword: #p
keyword: freq=noraman
keyword: PBEPBE/SDD
title: #p freq=noraman PBEPBE/SDD
converged: YES YES NO NO
title: Mulliken charges:
elementType: F F F O O O O O O N C C C C C C C C H H H H H H H H H H H H
charge: -0.144153 -0.139397 -0.174806 -0.246693 -0.474159 -0.479085 -0.440984 -0.464696 -0.232460 -0.409964 -0.172320 -0.013578 -0.120191 -0.040301 -0.189846 -0.412021 0.184752 0.292827 0.298326 0.270434 0.222838 0.245589 0.306447 0.235040 0.244736 0.376169 0.377809 0.367085 0.367837 0.364766
chargesum: 0.00000
title: Mulliken charges with hydrogens summed into heavy atoms:
elementType: F F F O O O O O O N C C C C C C C C
charge: -0.144153 -0.139397 -0.174806 -0.246693 -0.096350 -0.111999 -0.073147 -0.099931 -0.232460 -0.033794 0.098114 0.284748 0.102647 0.205288 0.116601 0.067755 0.184752 0.292827
polarizability: 1.31063125e+02 7.91770486e+00 1.10857663e+02 1.43472320e+00 4.48404520e+00 9.66034158e+01
1716.lowfreq: -24.1905 -8.8399 -3.6833 -0.0007 -0.0006 0.0009 21.0996 30.6655 45.7577
frequency: 19.6622 30.5240 45.7415 76.6902 83.3296 110.5466 130.8368 164.6203 184.8973 192.9020 208.1804 244.5293 248.5955 270.8633 282.3278 287.9852 319.1619 344.9705 359.5204 377.5693 381.2921 436.8323 443.9552 456.9663 488.8313 497.6915 506.8306 530.5265 557.5844 636.4339 648.0236 652.6740 711.1521 733.0790 774.7582 823.3085 848.5338 877.3423 913.1987 937.6508 949.5415 980.7724 996.3979 1017.2383 1019.7461 1032.6752 1034.3558 1057.4131 1073.9215 1090.7578 1136.6918 1141.1406 1161.8372 1189.7983 1224.7067 1251.0359 1259.0787 1265.4016 1292.9788 1297.7949 1312.2148 1320.4575 1330.3731 1341.7506 1357.5600 1369.9710 1375.8161 1389.2906 1419.0822 1471.8023 1494.6150 1650.9095 2956.1612 2988.5994 3019.6769 3022.6260 3033.5185 3087.3845 3104.3059 3379.9985 3450.6474 3546.6834 3584.5906 3592.3880
redmass: 12.8306 8.1361 11.3854 7.1649 5.2917 6.7537 5.4548 4.4563 9.0481 4.0926 8.3125 5.4935 2.0394 2.0019 6.6140 9.0455 4.5826 2.6270 3.9785 1.7151 12.8538 4.7699 11.3417 3.3007 3.4821 2.8134 1.9099 7.4808 5.2622 3.4898 3.0076 1.8535 9.3740 1.4478 3.4549 3.8875 6.7504 2.0852 2.8006 4.6771 6.1761 4.7611 5.4593 4.6284 7.0958 3.3902 8.4867 1.9982 2.9165 2.3202 2.6341 2.9307 1.8879 1.0972 1.5496 1.2734 1.2520 1.2981 1.2662 1.6141 1.2496 1.2960 1.2297 1.2558 1.2531 1.4074 1.4418 1.6430 1.5830 1.0852 1.9273 10.4441 1.0821 1.0848 1.0617 1.0838 1.0862 1.0893 1.1053 1.0660 1.0774 1.0654 1.0664 1.0668
irintensity: 0.2945 0.2237 2.1800 2.8859 11.3361 1.5438 2.0040 15.9643 6.8126 10.5912 16.6835 0.5206 91.8515 75.7837 18.9669 9.2934 6.0113 40.0289 18.1493 97.0403 3.2913 11.5468 4.2634 26.4723 50.5998 21.4400 86.5209 25.7427 27.9681 93.5891 32.9787 48.0366 21.6847 36.9987 70.0856 66.9699 72.4334 28.4579 8.7395 101.9993 79.1210 38.8754 54.3864 60.4794 264.1765 164.4241 160.4003 4.6062 38.3541 21.3152 0.4754 166.4230 4.8857 41.4990 66.2306 1.5820 23.7535 13.2413 4.0010 15.5842 5.3074 40.0736 48.2908 2.8450 9.6653 1.9253 17.1590 24.9610 19.7346 9.9609 200.7435 262.5499 23.9859 38.7103 33.0346 7.1703 28.6599 2.0548 20.6473 180.3085 119.1450 31.6941 18.3223 19.8883
temp: 298.150 k
press: 1.00000 atm
elementType: 9 9 9 8 8 8 8 8 8 7 6 6 6 6 6 6 6 6 1 1 1 1 1 1 1 1 1 1 1 1
symmnumber: 1
zpe: 567710.7 jmol-1
zpe.correction: 0.216230 hartree
zpe.thermalcorrener: 0.234492 hartree
zpe.thermalcorrenthalpy: 0.235436 hartree
zpe.thermalcorrgfe: 0.168769 hartree
zpe.sumelectzpe: -1116.227191 hartree
zpe.sumelectthermal: -1116.208928 hartree
zpe.sumelectthermalent: -1116.207984 hartree
zpe.sumelectthermalfe: -1116.274652 hartree
dipole: -6.9661 1.0547 0.5107
dipole: 7.0640
quadrupole: -101.6486 -102.5247 -108.4518
quadrupole: -9.6557 -8.1125 1.0540
quadrupole: 2.5597 1.6837 -4.2434 -9.6557 -8.1125 1.0540
hfenergy: -1116.4434201 hartree
pointgroup: C01 [X(C8H12F3N1O6)]
dipole: -2.7432544 -0.3272553 0.3021145 debye
polarizability: 131.0243922|-6.3048109|105.1350672|5.0404183|-8.3446652|102.3647443 unknown
InChI: InChI=1S/C8H12F3NO6/c9-8(10,11)7(17)12-3-5(15)4(14)2(1-13)18-6(3)16/h2-6,12-16H,1H2
charge 0 multiplicity 1
30 atoms
F  3.431586 -1.346281 -1.611603
F  4.541779 0.175193 -0.351192
F  2.936562 0.862901 -1.804983
O  -1.356553 -1.427619 0.42027
O  -0.384969 2.653302 -0.028901
O  -2.878691 1.733557 -0.987892
O  -1.371507 -0.537025 2.663154
O  -4.225861 -0.547732 -1.792488
O  2.450027 -1.155249 1.189753
N  1.127582 0.459641 0.10421
C  -1.0531 1.468997 0.524562
C  0.0471 0.556457 1.103377
C  -1.853747 0.767541 -0.58333
C  -2.454238 -0.554705 -0.062041
C  -0.55936 -0.821561 1.488112
C  -3.145094 -1.358332 -1.175406
C  2.229229 -0.328855 0.261084
C  3.282308 -0.15955 -0.872109
H  0.449067 0.995848 2.035777
H  -1.750146 1.750654 1.336129
H  -1.181884 0.531971 -1.438217
H  -3.157563 -0.336105 0.768399
H  0.228677 -1.564175 1.689166
H  -3.533443 -2.316581 -0.784121
H  -2.432892 -1.568279 -1.989467
H  1.120654 1.21124 -0.599177
H  -1.072055 3.162771 -0.533019
H  -3.52929 1.239136 -1.566346
H  -1.610723 -1.387461 3.108828
H  -5.068557 -0.671301 -1.290125
