program: Gaussian 09
title: 000286293
version: EM64L-G09RevD.01
frameworkgroup: C1[X(C16H17NO4)]
method: RPBEPBE
basis: SDD
operation: Freq
keyword: #p
keyword: freq=noraman
keyword: PBEPBE/SDD
title: #p freq=noraman PBEPBE/SDD
converged: NO YES NO NO
title: Mulliken charges:
elementType: O O O O N C C C C C C C C C C C C C C C C H H H H H H H H H H H H H H H H H
charge: -0.417926 -0.253943 -0.229171 -0.263681 -0.446638 -0.223656 -0.267162 -0.350265 -0.225491 -0.529318 -0.217886 -0.200954 0.201197 0.120405 0.497274 -0.469380 -0.325908 -0.326866 -0.353251 0.322563 -0.538188 0.246102 0.285575 0.276447 0.329812 0.258524 0.226509 0.242654 0.244378 0.305809 0.379268 0.216925 0.309780 0.240870 0.251294 0.218885 0.219362 0.246049
chargesum: 0.00000
title: Mulliken charges with hydrogens summed into heavy atoms:
elementType: O O O O N C C C C C C C C C C C C C C C C
charge: -0.038658 -0.253943 -0.229171 -0.263681 -0.140829 0.022446 0.018414 -0.073817 0.104321 -0.044284 0.024768 0.043424 0.201197 0.120405 0.497274 -0.252455 -0.016127 -0.085997 -0.101957 0.322563 0.146109
polarizability: 2.94910743e+02 -1.15040858e-01 1.34829462e+02 9.25808951e+00 4.98549788e+00 1.59255648e+02
1716.lowfreq: -6.9832 -6.0217 -2.6844 -0.0003 0.0004 0.0006 17.4352 20.8490 31.4511
frequency: 16.9585 20.8188 31.3828 51.4197 66.1533 86.9468 101.5936 130.5815 140.9945 169.8378 187.7484 215.5027 239.4304 260.7834 306.9054 348.7352 354.4452 383.4887 408.4712 415.7825 427.4950 473.4417 486.3713 517.5574 524.7237 563.8390 610.6219 618.0376 629.4145 634.2934 658.3159 693.9844 705.7325 723.6893 734.4187 771.9862 784.1173 800.1506 802.0275 836.3738 852.1222 853.2395 885.3951 908.4122 917.2770 922.6859 932.6389 947.8316 962.5369 970.7515 987.5349 988.3751 992.5532 1000.3835 1012.5799 1058.9367 1071.9359 1092.0008 1110.5678 1111.3015 1118.8227 1144.4394 1156.4168 1161.0585 1173.5110 1181.8671 1197.1166 1221.6879 1232.2492 1247.6657 1263.4476 1267.5060 1272.9579 1281.5172 1299.0626 1308.5867 1322.4118 1346.5246 1374.5708 1422.6095 1435.5587 1465.9433 1471.4734 1472.2055 1499.0638 1508.4140 1585.5809 1591.1496 1617.3878 1629.8202 1651.4733 2955.1723 2977.2435 3008.7587 3018.3525 3041.2806 3073.7090 3093.2932 3111.9879 3113.1815 3124.0358 3162.3129 3163.6524 3165.0094 3196.0948 3196.9674 3506.0500 3520.9283
redmass: 5.5066 10.9280 4.4815 4.5277 4.9118 6.1389 3.8994 4.8410 4.9340 4.5079 3.3677 4.2116 1.3325 4.7455 5.5875 6.3617 4.4059 5.0618 4.2534 3.0472 4.4259 2.6409 2.4422 4.0122 2.4336 3.5364 2.4612 3.7989 2.5146 1.6211 2.2704 4.3268 2.5572 3.5794 2.6537 5.5703 5.3264 1.4487 4.1518 5.4906 1.4917 2.6272 3.3612 2.4336 1.3925 1.5218 2.6710 3.7218 2.8167 2.9911 3.8254 1.5988 1.7426 2.6776 1.7379 2.5960 1.9197 1.2187 1.1537 1.2609 1.3214 1.2945 1.3353 1.8641 2.1020 1.2706 1.4755 2.3735 1.3597 1.5012 1.4391 1.8992 1.6706 1.7389 1.5195 1.6121 1.7636 1.8613 4.7927 4.1926 1.1688 1.0503 1.1019 1.0741 2.1906 2.4885 5.8791 6.6049 4.6488 6.4169 9.0853 1.0332 1.0816 1.0628 1.0833 1.1038 1.0902 1.1036 1.0895 1.0911 1.0990 1.0918 1.0924 1.0876 1.0955 1.1097 1.0639 1.0760
irintensity: 1.0198 1.4926 1.0660 0.1415 0.3285 3.1707 9.4160 0.1059 0.2574 2.6974 2.1890 6.7188 0.3537 7.7737 11.8698 0.9545 0.7520 3.6708 8.4824 0.0071 6.4945 4.1439 5.7129 35.9019 25.0495 18.9362 46.4638 21.7508 25.7801 24.9834 79.4780 2.6835 26.0969 0.1585 54.2729 4.1915 6.4490 34.3850 18.7134 3.9667 63.6323 24.3551 7.5267 5.2967 1.5516 7.6692 7.1585 7.3456 29.8738 16.4849 36.5788 12.2197 1.6017 18.7090 25.9431 64.2969 98.7235 1.2288 40.9740 0.2470 19.0701 15.0863 0.6693 30.1369 129.8874 22.7745 22.2543 230.8768 12.3012 25.4190 4.3797 3.0022 4.8745 13.5682 17.7560 11.6516 12.7901 32.6481 130.5215 8.6699 16.0240 13.4154 23.2533 98.7069 30.8082 587.1857 4.7203 76.5055 106.0898 1.7223 286.1891 81.8968 39.0863 38.4761 12.2780 52.0348 39.3138 32.3333 24.0918 13.3880 23.2461 9.5334 8.2266 4.5396 6.6869 13.0746 18.1786 10.5158
temp: 298.150 k
press: 1.00000 atm
elementType: 8 8 8 8 7 6 6 6 6 6 6 6 6 6 6 6 6 6 6 6 6 1 1 1 1 1 1 1 1 1 1 1 1 1 1 1 1 1
symmnumber: 1
zpe: 788720.4 jmol-1
zpe.correction: 0.300408 hartree
zpe.thermalcorrener: 0.319207 hartree
zpe.thermalcorrenthalpy: 0.320151 hartree
zpe.thermalcorrgfe: 0.250537 hartree
zpe.sumelectzpe: -973.994741 hartree
zpe.sumelectthermal: -973.975942 hartree
zpe.sumelectthermalent: -973.974998 hartree
zpe.sumelectthermalfe: -974.044612 hartree
dipole: 2.7322 -0.1633 4.9922
dipole: 5.6932
quadrupole: -118.3256 -120.1637 -116.4349
quadrupole: 2.9419 8.3564 2.8376
quadrupole: -0.0175 -1.8557 1.8731 2.9419 8.3564 2.8376
hfenergy: -974.2951485 hartree
pointgroup: C01 [X(C16H17N1O4)]
dipole: -1.068757 -0.6119559 -1.8709361 debye
polarizability: 294.8498606|2.5079614|134.0621573|9.3534683|2.3834599|160.0838344 unknown
InChI: InChI=1S/C16H17NO4/c1-21-12-6-4-11(5-7-12)17-15(18)13-9-2-3-10(8-9)14(13)16(19)20/h2-7,9-10,13-14,17,19H,8H2,1H3
charge 0 multiplicity 1
38 atoms
O  2.877886 2.485492 -0.976917
O  0.476779 0.424723 1.438548
O  5.023454 1.879633 -0.343835
O  -6.077074 0.232313 0.547274
N  -0.539459 -0.111415 -0.608652
C  2.300704 -1.693356 -0.601649
C  4.087815 -0.790684 0.485505
C  1.905077 -0.148573 -0.487224
C  3.114857 0.44445 0.309954
C  3.833208 -1.541032 -0.860316
C  2.313129 -2.274759 0.817887
C  3.385692 -1.735637 1.465706
C  0.562432 0.095074 0.216616
C  3.798499 1.623933 -0.35116
C  -1.928214 -0.019273 -0.294222
C  -2.857896 -0.261496 -1.335594
C  -2.411354 0.301557 1.005717
C  -4.247869 -0.189346 -1.104418
C  -3.795434 0.373263 1.236291
C  -4.721429 0.130594 0.191812
C  -7.067434 -0.003337 -0.504232
H  1.711925 -2.243917 -1.351883
H  5.120474 -0.498536 0.718235
H  1.86492 0.278884 -1.506353
H  2.735438 0.794875 1.29243
H  4.350776 -2.512975 -0.908191
H  4.078283 -0.938952 -1.755068
H  1.530768 -2.909719 1.240099
H  3.646428 -1.844259 2.521151
H  -0.327374 -0.351588 -1.580276
H  3.367879 3.277286 -1.330835
H  -2.498594 -0.508912 -2.343285
H  -1.697778 0.492125 1.808861
H  -4.937614 -0.381194 -1.931345
H  -4.182175 0.619666 2.229795
H  -6.990277 -1.031798 -0.909001
H  -6.961903 0.728247 -1.329532
H  -8.043744 0.129043 -0.01539
