program: Gaussian 09
title: 000286270
version: EM64L-G09RevD.01
frameworkgroup: C1[X(C12H9NO4)]
method: RPBEPBE
basis: SDD
operation: Freq
keyword: #p
keyword: freq=noraman
keyword: PBEPBE/SDD
title: #p freq=noraman PBEPBE/SDD
converged: YES YES NO NO
title: Mulliken charges:
elementType: O O O O N C C C C C C C C C C C C H H H H H H H H H
charge: -0.257066 -0.283051 -0.177363 -0.171571 -0.038533 0.270649 0.107110 -0.341849 -0.316578 0.265273 -0.218265 -0.219780 -0.220037 -0.424568 0.191151 0.261572 -0.737036 0.278139 0.278355 0.236015 0.236617 0.236214 0.275468 0.259033 0.258785 0.251316
chargesum: 0.00000
title: Mulliken charges with hydrogens summed into heavy atoms:
elementType: O O O O N C C C C C C C C C C C C
charge: -0.257066 -0.283051 -0.177363 -0.171571 -0.038533 0.270649 0.107110 -0.063710 -0.038222 0.265273 0.017751 0.016837 0.016176 -0.149099 0.191151 0.261572 0.032098
polarizability: 2.27961384e+02 -1.74917879e+01 1.90240814e+02 7.40739889e+00 3.24374952e+00 7.21702486e+01
1716.lowfreq: -0.0007 0.0004 0.0007 2.1109 4.2917 6.2560 33.9233 47.9702 54.6474
frequency: 33.9058 47.9684 54.6466 67.8623 88.3941 94.4593 128.5770 159.4245 192.7035 237.0760 265.8876 292.1617 345.3444 386.8187 402.3027 449.4965 460.3519 529.8784 538.6227 546.9284 610.6499 617.3224 627.3728 654.1348 688.5168 698.9550 709.5190 727.5458 773.4515 796.8328 850.3431 864.5117 873.6661 927.7566 958.1540 979.6142 989.4617 999.2830 1011.8490 1019.6413 1036.9834 1040.0765 1087.1457 1114.7939 1136.2666 1173.8829 1176.0329 1188.1255 1267.2099 1319.3211 1362.6670 1386.4111 1393.4756 1438.7484 1450.2220 1452.2886 1475.5660 1519.3571 1559.2851 1587.1419 1612.4876 1710.4946 1735.6565 3009.8526 3099.2099 3134.2081 3146.1294 3147.9579 3160.5391 3173.0858 3179.6319 3209.8370
redmass: 4.7903 4.4886 3.2523 7.1705 1.5544 2.6297 6.8517 8.3898 5.7367 7.5753 7.9176 4.0291 6.8432 7.5790 2.8389 3.7155 6.4621 4.9310 3.8198 8.5846 6.7792 6.8758 7.8959 4.5144 6.0895 1.8189 8.2471 4.4630 5.4567 2.1930 1.6168 1.2448 10.4310 7.3790 1.4170 2.3746 6.1274 1.3853 1.3375 3.0776 2.5787 1.6582 1.6110 2.8082 4.1634 2.5740 1.1060 1.1384 2.5818 1.3450 3.9824 1.2425 8.7756 2.3374 1.0469 1.0538 2.6695 7.6625 8.6314 6.3247 6.0505 10.7853 11.8522 1.0372 1.0963 1.0859 1.1017 1.0896 1.0943 1.0958 1.0995 1.0932
irintensity: 0.3865 2.5266 3.1572 0.5723 0.3573 0.2027 0.3053 3.7887 3.1552 0.4103 0.6410 2.2896 2.4130 4.9555 0.0463 1.3707 5.5338 16.7342 18.2934 8.2079 5.1291 8.4785 7.2673 0.6628 7.2844 74.2402 84.2921 27.0913 54.0496 26.0387 52.4275 0.0618 57.3575 34.6009 4.3565 151.5549 1.8499 0.0359 0.2932 84.7407 85.4943 12.9732 2.8769 314.7655 453.1453 48.8840 3.0298 14.4970 105.5265 8.2487 102.4329 67.4039 13.5422 54.1554 20.4402 24.5035 190.6392 525.9917 140.3712 5.5728 28.1786 211.1648 581.8207 0.2317 4.6649 0.1991 8.5709 12.3851 17.7562 7.4505 15.4046 2.5677
temp: 298.150 k
press: 1.00000 atm
elementType: 8 8 8 8 7 6 6 6 6 6 6 6 6 6 6 6 6 1 1 1 1 1 1 1 1 1
symmnumber: 1
zpe: 485597.0 jmol-1
zpe.correction: 0.184954 hartree
zpe.thermalcorrener: 0.199940 hartree
zpe.thermalcorrenthalpy: 0.200884 hartree
zpe.thermalcorrgfe: 0.140876 hartree
zpe.sumelectzpe: -817.126926 hartree
zpe.sumelectthermal: -817.111941 hartree
zpe.sumelectthermalent: -817.110996 hartree
zpe.sumelectthermalfe: -817.171004 hartree
dipole: -0.0488 -4.1119 -1.7861
dipole: 4.4833
quadrupole: -67.7599 -105.8444 -102.8130
quadrupole: 0.7451 4.4335 3.4420
quadrupole: 24.3792 -13.7053 -10.6739 0.7451 4.4335 3.4420
hfenergy: -817.3118803 hartree
pointgroup: C01 [X(C12H9N1O4)]
dipole: 0.0405661 -1.6140098 -0.7103411 debye
dipolederiv: -0.7907521 0.5330922 0.0489265 0.3579426 -1.1430256 -0.1018399 -0.0068884 -0.0744775 -0.1664478 -1.2198323 -0.8324763 0.0450204 -1.1843302 -1.6609652 0.335216 0.0497586 0.1669064 -0.4688871 -0.3543733 -0.1551057 -0.0045121 0.2202027 -1.556597 -0.090566 0.0115011 -0.1412292 -0.3255397 -0.4241948 0.0741231 -0.2841893 -0.3374181 -0.6150532 0.0939985 0.0804069 0.4265182 -0.7501453 -2.0730735 0.3190026 0.0233652 -0.1493617 -0.3893812 -0.0485561 -0.1475207 -0.065553 -0.1794693 -0.6598281 0.2698306 0.0085385 0.3243466 -0.2019943 -0.0057791 0.0128507 -0.0057566 -0.0246052 1.9586177 -0.4583729 0.0188862 -0.0698048 0.8306037 0.0845395 0.097885 0.0449568 0.1910754 0.0645644 0.0927792 0.0138449 -0.2669898 0.0456463 0.0067865 -0.0263855 0.0104002 -0.1012991 0.2156966 -0.2195911 -0.0099591 0.1314894 -0.0014262 0.0063177 0.0273506 0.0007974 -0.1039069 2.1048735 0.3624187 -0.1310404 0.1752982 1.4353251 0.0646054 0.1591424 0.3161964 0.1551958 -0.2974108 -0.0412801 -0.0062178 -0.0938917 0.1796317 0.0202152 -0.0070127 0.018837 -0.1493258 -0.0031248 0.2105282 0.0225961 0.3219648 -0.170008 0.0039515 0.0282797 0.0055806 -0.1500196 0.0987212 -0.0236087 0.008151 -0.0674719 0.0857803 0.0147868 0.0042954 0.0131955 -0.1258495 -0.3614298 -0.4571757 0.0052141 0.0555158 -1.0736068 -0.0402142 0.0067758 -0.0793819 -0.1953747 0.7734658 0.1212922 -0.006415 -0.4973838 2.2965906 0.1631051 0.0015622 0.2128739 0.2919857 0.8685352 0.3842827 0.3708822 1.2757114 1.8065293 -0.3965839 -0.1378001 -0.7203151 1.0849367 -0.2181875 -0.1681794 -0.1276562 -0.2207785 -0.156099 -0.0788319 -0.2124474 -0.1508637 -0.1363538 0.054468 -0.081602 -0.0083393 -0.0702009 0.0825706 -0.0054162 -0.0096886 -0.0057411 0.1465483 0.1419336 0.0132949 -0.0018498 0.0034598 -0.0069189 -0.0110369 -0.0037758 -0.0104972 0.1552886 0.0709593 0.017135 -0.0003831 0.0504147 -0.1107357 -0.0184762 0.0013221 -0.0172659 0.157 -0.0684467 -0.0715298 -0.0118014 -0.0992536 0.0275653 -0.0127109 -0.0153417 -0.011413 0.1578316 -0.0877534 0.0836755 -0.0015924 0.0839176 0.0591543 -0.0043827 -0.0034733 -0.0037513 0.1562434 0.0351916 0.0097546 -0.0039556 0.0477364 0.1021298 -0.015154 -0.0059044 -0.0127445 0.1911336 0.0728139 0.0167792 0.0755787 -0.0107613 0.0972434 -0.0512358 0.0721112 -0.0426785 0.0085371 0.0280057 0.0541133 -0.0387286 0.1017842 0.0367257 0.017161 -0.0089425 0.0285103 0.1402875 0.0705606 -0.0531804 -0.0043638 -0.0821377 0.000315 0.0701008 0.0319394 0.0968958 0.0411602 unknown
polarizability: 229.6608833|-15.6861742|188.7174323|4.3457987|4.346458|71.994131 unknown
InChI: InChI=1S/C12H9NO4/c1-8(14)16-10-7-11(15)17-12(13-10)9-5-3-2-4-6-9/h2-7H,1H3
charge 0 multiplicity 1
26 atoms
O  0.412536 1.885945 0.109346
O  -3.021407 -0.360559 -0.379969
O  -0.799373 3.877539 0.253182
O  -2.606807 -1.840086 1.410545
N  -0.668577 -0.23131 -0.191955
C  1.774091 -0.09211 -0.046173
C  0.430018 0.504782 -0.046418
C  1.904548 -1.505328 -0.142153
C  2.934136 0.72421 0.053267
C  -1.878449 0.425085 -0.157642
C  3.184224 -2.092318 -0.141604
C  4.210823 0.127907 0.052663
C  4.339636 -1.278401 -0.045283
C  -2.044362 1.793122 -0.008739
C  -0.889125 2.650224 0.123439
C  -3.221615 -1.584917 0.369242
C  -4.292842 -2.393865 -0.314923
H  0.996912 -2.112344 -0.209158
H  2.820355 1.809393 0.129186
H  3.284903 -3.180388 -0.212864
H  5.104564 0.756007 0.128642
H  5.334239 -1.738023 -0.044455
H  -3.0340 2.250686 0.008482
H  -3.900191 -2.793547 -1.266996
H  -5.157444 -1.75518 -0.560518
H  -4.603791 -3.226424 0.332058
