program: Gaussian 09
title: 000286232
version: EM64L-G09RevD.01
frameworkgroup: C1[X(C15H26O2)]
method: RPBEPBE
basis: SDD
operation: Freq
keyword: #pfreq=noraman
keyword: PBEPBE/SDD
title: #p freq=noraman PBEPBE/SDD
converged: YES YES NO NO
title: Mulliken charges:
elementType: O O C C C C C C C C C C C C C C C H H H H H H H H H H H H H H H H H H H H H H H H H H
charge: -0.478840 -0.205951 0.362390 -0.076625 -0.238269 -0.132268 -0.477343 -0.449931 -0.438203 0.230198 -0.873975 -0.404881 0.144885 -0.539828 -0.796295 -0.760133 -0.732814 0.206150 0.228306 0.228801 0.213776 0.227303 0.218257 0.199883 0.191491 0.217042 0.275176 0.205359 0.230664 0.202754 0.201026 0.270309 0.233122 0.207070 0.226249 0.224669 0.198065 0.214869 0.255319 0.240152 0.205027 0.213307 0.333736
chargesum: 0.00000
title: Mulliken charges with hydrogens summed into heavy atoms:
elementType: O O C C C C C C C C C C C C C C C
charge: -0.145103 -0.205951 0.362390 0.129524 -0.009963 0.096533 -0.036264 -0.031790 -0.029670 0.230198 -0.162775 -0.001101 0.144885 -0.036396 -0.138308 -0.091880 -0.074329
polarizability: 1.79321917e+02 2.05463834e+00 1.63361652e+02 1.80968243e+00 1.75528882e+00 1.35850327e+02
1716.lowfreq: -14.8711 -4.8900 -0.0003 0.0008 0.0008 9.6158 49.6951 67.9035 76.7688
frequency: 49.5131 67.6913 76.5225 128.9669 139.9802 161.4854 187.8321 200.5021 209.1391 243.0941 252.8801 263.5391 273.5057 278.6744 286.4511 290.7571 299.7442 314.1131 344.1644 364.4225 385.0947 399.5122 428.5085 437.9999 459.8283 481.1276 503.6904 529.4168 543.9681 547.2439 600.2010 660.5174 704.0405 740.7656 794.6500 804.8332 815.9560 846.8466 863.2644 880.0746 893.1444 904.3025 922.9302 933.5763 943.8460 955.8351 976.8312 987.4908 1002.0813 1012.5469 1026.1824 1054.9066 1072.7609 1085.7104 1094.1964 1109.5746 1122.2846 1135.6623 1141.0594 1155.5632 1160.2766 1165.1257 1183.5271 1203.0573 1218.1435 1224.7028 1254.0696 1266.8447 1277.8191 1287.9774 1303.3706 1305.1217 1320.3982 1328.5846 1337.2087 1341.9062 1348.6124 1349.3570 1357.4871 1373.1250 1389.3087 1391.8769 1402.7866 1440.5759 1456.9458 1460.9260 1462.3821 1466.8652 1470.8107 1472.6540 1476.6964 1481.1919 1484.9127 1489.8795 1490.5115 1509.6468 1618.0968 2924.4643 2970.8236 2972.7054 2973.7208 2978.8870 2979.8971 2984.7254 2988.9009 2995.6469 2997.1403 2999.8755 3020.6215 3024.0644 3035.6459 3054.0025 3054.6004 3055.3568 3060.7092 3064.9269 3066.3557 3069.4586 3078.0489 3098.5825 3107.6650 3123.6770 3548.8211
redmass: 4.8949 3.2170 2.6572 2.8397 1.3560 2.7785 1.5744 1.1829 2.1301 1.9366 1.5118 2.0280 2.7861 2.0531 1.1102 2.6327 2.8368 2.6854 2.7639 2.4566 2.2784 3.1512 3.2478 2.2172 3.3810 2.2661 3.1164 3.1619 2.7647 2.5308 2.7353 2.4916 2.9157 4.0559 2.8243 2.3487 2.4148 1.8198 2.0971 2.1523 1.9089 1.9171 1.9264 1.9892 1.7814 1.9730 1.7427 1.5514 1.5032 1.7780 1.6727 1.6882 1.5143 1.8065 1.9630 2.1740 1.6980 2.2872 1.3160 2.2230 2.0545 2.3262 2.3901 1.7292 1.5721 1.8619 1.5194 1.5652 1.2998 1.2804 1.4206 1.5559 1.5490 1.4477 1.4750 1.4147 1.3982 1.5050 1.4734 1.2206 1.2049 1.1975 1.1689 1.0750 1.0528 1.0565 1.0770 1.0744 1.0757 1.0655 1.0648 1.0679 1.0575 1.0596 1.0584 1.0489 11.2953 1.0794 1.0597 1.0390 1.0408 1.0410 1.0597 1.0704 1.0405 1.0649 1.0788 1.0602 1.0825 1.0979 1.0993 1.0997 1.0990 1.0970 1.0978 1.0962 1.0972 1.0983 1.0934 1.0968 1.0981 1.0961 1.0658
irintensity: 1.1805 0.2677 2.7194 0.7723 0.9439 0.8250 0.5805 1.5617 2.9850 1.4274 2.2979 4.1998 0.9289 10.7607 96.9773 3.4463 2.9649 5.6346 2.2916 2.4530 2.4894 3.9865 0.7721 2.2514 4.0653 2.3404 2.7331 4.6915 2.6146 3.5086 2.2226 1.5774 1.3993 8.9034 7.4816 3.4165 14.9721 12.9094 0.9606 2.9681 6.0767 3.7325 9.4198 11.4973 5.9183 2.7413 4.9271 7.0254 9.8619 0.7240 1.8163 6.7452 27.6702 9.7962 6.4456 2.6238 32.9748 10.5830 10.7525 4.3703 15.7788 16.3336 8.2345 18.7591 8.3221 20.9571 3.0860 28.9988 7.2111 5.7983 11.0853 27.2605 10.8020 7.4011 6.2362 3.7700 5.2571 3.0228 0.9098 15.9210 16.0401 37.3539 12.6764 23.8632 0.3476 3.2317 7.9330 18.3264 19.2897 3.8665 2.9449 13.9418 8.6141 6.2569 25.2451 15.7011 162.9591 14.4167 24.9753 9.2364 19.9310 41.4266 60.9796 24.1708 20.6556 16.9394 46.2852 13.5492 18.9534 47.1141 66.7532 12.6388 39.0937 13.4182 61.9367 68.5930 19.2626 50.8835 30.5215 28.8430 5.4182 15.8019 3.6176
temp: 298.150 k
press: 1.00000 atm
elementType: 8 8 6 6 6 6 6 6 6 6 6 6 6 6 6 6 6 1 1 1 1 1 1 1 1 1 1 1 1 1 1 1 1 1 1 1 1 1 1 1 1 1 1
symmnumber: 1
zpe: 1000036.9 jmol-1
zpe.correction: 0.380894 hartree
zpe.thermalcorrener: 0.399003 hartree
zpe.thermalcorrenthalpy: 0.399947 hartree
zpe.thermalcorrgfe: 0.337466 hartree
zpe.sumelectzpe: -736.258122 hartree
zpe.sumelectthermal: -736.240013 hartree
zpe.sumelectthermalent: -736.239069 hartree
zpe.sumelectthermalfe: -736.301550 hartree
dipole: -3.6813 -3.8526 -1.0197
dipole: 5.4253
quadrupole: -102.0200 -116.4537 -103.9022
quadrupole: -7.0880 -2.9993 -3.1736
quadrupole: 5.4387 -8.9951 3.5564 -7.0880 -2.9993 -3.1736
hfenergy: -736.6390162 hartree
pointgroup: C01 [X(C15H26O2)]
dipole: 1.4590055 1.4729701 -0.5076256 debye
polarizability: 179.3535442|1.816012|162.9373233|-1.9013481|-3.7142729|136.2430286 unknown
InChI: InChI=1S/C15H26O2/c1-10-6-5-7-11-12(16)8-9-13(14(2,3)17)15(10,11)4/h10-11,13,17H,5-9H2,1-4H3
charge 0 multiplicity 1
43 atoms
O  2.778783 -0.674143 1.138627
O  -1.965093 -2.863014 0.457928
C  -0.242708 0.348891 0.214077
C  1.118523 -0.021451 -0.541667
C  -1.377822 -0.61559 -0.34356
C  -0.675816 1.847292 -0.093721
C  -2.8240 -0.247014 0.067126
C  1.163921 -1.527185 -0.991893
C  -2.101369 2.14019 0.45704
C  2.4905 0.380585 0.119094
C  -0.157526 0.153821 1.766764
C  -3.165219 1.232251 -0.193692
C  -1.072518 -2.070959 0.048123
C  0.382798 -2.487651 -0.080219
C  -0.595319 2.269154 -1.586793
C  2.531953 1.767635 0.803414
C  3.619761 0.356221 -0.948694
H  1.104142 0.564207 -1.479457
H  -1.312958 -0.57709 -1.455959
H  0.019997 2.503248 0.46506
H  -2.965005 -0.476235 1.140988
H  -3.521444 -0.918366 -0.466033
H  2.209043 -1.873077 -1.035629
H  0.759927 -1.609867 -2.020019
H  -2.341909 3.208038 0.284361
H  -2.11971 1.984487 1.553701
H  0.656131 -0.534108 2.043469
H  0.032675 1.110997 2.285199
H  -1.104585 -0.24005 2.175739
H  -3.216537 1.428571 -1.283262
H  -4.168288 1.462672 0.214296
H  0.837659 -2.499172 0.929106
H  0.420507 -3.529219 -0.450799
H  0.444674 2.422116 -1.927751
H  -1.063793 1.532652 -2.265056
H  -1.125625 3.229208 -1.730747
H  3.564849 1.981736 1.143021
H  2.245228 2.571654 0.101899
H  1.874021 1.811175 1.683112
H  3.686173 -0.61793 -1.459902
H  4.599377 0.555457 -0.472274
H  3.457652 1.13855 -1.713387
H  3.660448 -0.480886 1.548572
