program: Gaussian 09
title: 000286262
version: EM64L-G09RevD.01
frameworkgroup: C1[X(C20H22Cl2N4)]
method: RPBEPBE
basis: SDD
operation: Freq
keyword: #p
keyword: freq=noraman
keyword: PBEPBE/SDD
title: #p freq=noraman PBEPBE/SDD
converged: YES YES NO NO
title: Mulliken charges:
elementType: Cl Cl N N N N C C C C C C C C C C C C C C C C C C C C H H H H H H H H H H H H H H H H H H H H H H
charge: -0.065258 -0.063645 -0.135204 -0.462319 -0.085305 -0.067666 0.483232 -0.418082 -0.418325 -0.598315 0.346695 0.315057 -0.375507 -0.427560 -0.555504 -0.557148 0.335758 -0.837907 -0.031234 -0.409113 0.267923 -0.511174 0.183104 -0.314504 -0.382057 -0.783997 0.239746 0.274508 0.238326 0.276901 0.222553 0.224736 0.276573 0.293337 0.265032 0.292149 0.263695 0.238765 0.228589 0.229022 0.222757 0.243463 0.303812 0.246573 0.250405 0.272514 0.231914 0.232684
chargesum: 0.00000
title: Mulliken charges with hydrogens summed into heavy atoms:
elementType: Cl Cl N N N N C C C C C C C C C C C C C C C C C C C C
charge: -0.065258 -0.063645 -0.135204 -0.158507 -0.085305 -0.067666 0.483232 0.096172 0.096903 -0.375762 0.346695 0.315057 -0.150772 -0.150987 0.002866 -0.001305 0.335758 -0.141530 -0.031234 -0.186356 0.267923 -0.267711 0.183104 -0.067931 -0.131651 -0.046884
polarizability: 6.14306085e+02 -3.60097195e+00 2.35277330e+02 -3.12014957e+00 -2.64853264e+01 1.73034500e+02
1716.lowfreq: -9.0282 -3.2310 -0.5129 -0.0018 -0.0015 0.0010 14.5644 18.2306 29.7392
frequency: 14.4865 18.2255 29.7220 32.6945 40.9828 59.1388 72.3021 84.6867 92.2840 92.4629 106.8861 131.0348 138.6797 146.6270 171.1586 184.0697 196.0651 211.5342 235.9891 245.5211 266.4488 280.5871 293.3179 349.8864 376.9845 385.1951 398.0891 415.6560 428.7333 439.3270 461.3408 473.0383 490.8548 510.3826 535.2466 544.7469 550.2723 586.8659 595.9664 600.7358 605.9677 623.6568 646.9401 650.4484 674.2912 678.4800 741.2013 767.7479 771.7960 811.9325 819.7694 829.3291 833.6873 838.7972 851.6763 862.3161 870.3982 919.6303 925.4507 939.3677 949.6599 958.4994 963.8731 968.2755 987.0845 996.3191 996.4828 1007.5294 1039.4669 1041.8866 1045.6237 1054.1226 1098.2328 1110.1394 1144.3450 1162.3931 1167.6298 1180.2123 1195.9181 1208.7513 1223.3721 1237.4224 1257.5137 1260.3732 1266.1899 1282.7459 1295.3358 1302.2552 1305.6404 1343.6588 1350.5188 1355.6672 1358.6398 1371.9049 1379.9431 1394.8997 1397.8276 1401.7929 1437.2219 1440.2909 1442.8375 1447.2645 1467.0846 1467.4636 1469.1684 1471.7299 1480.2371 1483.8200 1494.2269 1516.5879 1529.9654 1548.3641 1573.6201 1586.6363 1627.8788 1635.8583 2964.7840 2977.4056 2977.5879 2980.1119 2982.2777 3053.9701 3054.5493 3054.9430 3056.6509 3074.7915 3080.9424 3081.7325 3122.3101 3136.7171 3142.6468 3143.4374 3146.3660 3147.3684 3152.6189 3166.0491 3174.4591 3595.7127
redmass: 6.3459 6.7858 6.0157 8.7371 7.9693 4.8437 5.8586 5.5648 1.4332 2.5105 3.6189 3.6052 4.0677 1.1650 3.7717 3.6556 3.0843 4.0775 4.2340 4.1178 3.7741 3.3295 4.3567 3.8610 2.9630 3.0348 4.4880 4.1285 3.8724 2.9499 3.1979 3.3084 3.4543 3.2175 4.2462 3.3539 3.6584 1.2453 3.2061 4.6238 4.1013 4.9344 3.8697 3.3703 5.3793 4.9996 3.0315 3.0661 5.6181 3.3233 1.4442 3.1719 1.7619 2.4416 1.5249 2.6732 1.8105 1.9828 2.5255 2.8010 2.2038 1.9329 1.5364 1.7118 1.4078 2.2520 1.7157 1.8467 2.4935 1.6499 1.4866 1.5978 2.4518 1.5246 2.0033 1.1594 1.4767 1.8809 1.4342 2.8689 1.6018 1.3993 3.3774 1.5114 1.8249 1.6357 1.6331 1.3542 1.1900 2.5602 1.6709 1.6448 1.8978 4.8440 1.8310 1.4004 1.2660 2.0436 1.5548 1.1105 1.5454 2.4710 1.2334 1.1971 1.0461 1.0471 1.9839 1.9186 1.2151 2.4712 4.6904 7.3401 6.5861 6.6673 6.4762 7.2617 1.0816 1.0463 1.0624 1.0393 1.0684 1.0980 1.0580 1.0974 1.0582 1.0934 1.0930 1.0985 1.0962 1.0917 1.1056 1.0903 1.1069 1.0935 1.0878 1.0956 1.0975 1.0812
irintensity: 0.9261 1.8959 0.4959 1.4230 0.0110 0.0765 4.5695 1.5891 1.4221 3.3571 3.9525 3.1013 1.3852 0.7796 0.3614 2.5164 0.5428 3.8302 20.3050 4.7638 1.8651 1.6472 1.4734 5.3643 6.0633 4.0644 4.1571 5.0605 1.8178 6.5399 4.4997 22.0989 31.1768 8.2919 1.0052 10.9359 2.9971 81.1343 8.7000 13.9872 20.4165 2.8783 11.3856 13.9747 1.0754 5.0305 2.4523 1.4080 0.2514 22.0058 22.4906 15.7468 32.1560 12.5158 26.5131 32.9803 0.5894 106.8876 1.5008 4.6123 13.8727 18.7200 3.9672 4.7899 6.8438 0.1316 0.8428 4.0657 18.2019 8.6001 4.2105 1.2625 73.6724 22.7238 2.6072 13.1416 3.9329 43.4210 1.8551 31.3761 17.3654 202.4204 8.6228 4.7612 23.6510 2.0846 112.7875 40.7759 23.1936 45.5668 149.7598 269.7523 6.6031 14.1016 47.8913 52.6296 3.5341 18.4799 9.0858 0.5515 33.5447 22.7975 7.1010 22.0760 18.2484 11.1782 15.7657 16.2206 7.2326 314.1101 48.0313 53.8010 253.5605 235.5991 368.1115 15.8507 38.4777 24.5925 56.7538 60.3458 30.3872 19.3482 21.3279 16.7999 16.4324 1.3780 8.1200 26.8710 4.9114 8.2742 40.6257 21.1264 13.0160 13.7921 4.2159 28.0747 12.1322 34.4504
temp: 298.150 k
press: 1.00000 atm
elementType: 17 17 7 7 7 7 6 6 6 6 6 6 6 6 6 6 6 6 6 6 6 6 6 6 6 6 1 1 1 1 1 1 1 1 1 1 1 1 1 1 1 1 1 1 1 1 1 1
symmnumber: 1
zpe: 1001280.0 jmol-1
zpe.correction: 0.381367 hartree
zpe.thermalcorrener: 0.406697 hartree
zpe.thermalcorrenthalpy: 0.407641 hartree
zpe.thermalcorrgfe: 0.322203 hartree
zpe.sumelectzpe: -1912.583267 hartree
zpe.sumelectthermal: -1912.557938 hartree
zpe.sumelectthermalent: -1912.556994 hartree
zpe.sumelectthermalfe: -1912.642432 hartree
dipole: -1.5432 -5.0025 1.2400
dipole: 5.3800
quadrupole: -174.4817 -156.2579 -169.5086
quadrupole: -29.7648 2.2915 -14.6555
quadrupole: -7.7323 10.4915 -2.7592 -29.7648 2.2915 -14.6555
hfenergy: -1912.9646345 hartree
pointgroup: C01 [X(C20H22Cl2N4)]
dipole: -0.6173109 1.743129 -1.0298506 debye
polarizability: 614.2611158|6.1961836|215.6961013|1.4260739|-39.2183128|192.6606978 unknown
InChI: InChI=1S/C20H22Cl2N4/c1-14-11-18(26(9-7-21)10-8-22)5-3-16(14)13-23-17-4-6-19-20(12-17)25-15(2)24-19/h3-6,11-13,25H,7-10H2,1-2H3
charge 0 multiplicity 1
48 atoms
Cl -7.026386 -2.661807 -0.231129
Cl -6.944586 2.675506 0.827701
N  -5.069596 0.006363 0.144431
N  5.974124 1.304108 -0.256807
N  1.409651 -0.711194 0.527943
N  7.057003 -0.590407 0.407102
C  -3.670154 -0.004976 0.021011
C  -5.73771 -0.6458 1.281601
C  -5.920578 0.652326 -0.86573
C  -3.012235 0.606793 -1.093319
C  -1.610399 0.598152 -1.24602
C  -0.796978 -0.033628 -0.250022
C  -2.838771 -0.631696 1.006809
C  -1.448056 -0.635561 0.864453
C  -5.846205 -2.173443 1.1697
C  -6.008508 2.180517 -0.744191
C  4.957218 0.389876 0.06316
C  -1.003886 1.263472 -2.47365
C  5.658841 -0.793334 0.481771
C  0.664283 -0.077529 -0.35321
C  2.825814 -0.67031 0.46749
C  3.553911 0.478875 0.042595
C  7.211752 0.668433 -0.038606
C  4.923845 -1.921269 0.916297
C  3.521563 -1.842031 0.917742
C  8.521597 1.350364 -0.289532
H  -5.201817 -0.411511 2.223713
H  -6.744396 -0.210553 1.393109
H  -5.551434 0.413048 -1.883935
H  -6.931689 0.217603 -0.803405
H  -3.598725 1.100967 -1.873892
H  -3.274427 -1.114804 1.885452
H  -0.813652 -1.114747 1.617443
H  -4.890052 -2.653863 0.918521
H  -6.281868 -2.614488 2.079934
H  -5.023582 2.659926 -0.652649
H  -6.586026 2.618922 -1.573218
H  -0.424671 0.545367 -3.083629
H  -1.791183 1.688352 -3.119181
H  -0.317461 2.086502 -2.198946
H  1.119653 0.43004 -1.228173
H  3.029423 1.397764 -0.241892
H  5.846543 2.257629 -0.590433
H  5.445678 -2.822069 1.252454
H  2.911196 -2.682909 1.260482
H  9.333305 0.64745 -0.04958
H  8.629838 1.659637 -1.346344
H  8.644493 2.251736 0.340179
