program: Gaussian 09
title: 000286212
version: EM64L-G09RevD.01
frameworkgroup: C1[X(C9H11NO4S)]
method: RPBEPBE
basis: SDD
operation: Freq
keyword: #p
keyword: freq=noraman
keyword: PBEPBE/SDD
title: #p freq=noraman PBEPBE/SDD
converged: YES YES NO NO
title: Mulliken charges:
elementType: S O O O O N C C C C C C C C C H H H H H H H H H H H
charge: 1.006653 -0.286263 -0.534539 -0.480307 -0.281496 -0.648291 -0.037202 -0.194564 -0.262358 -0.217670 -0.202682 -0.212498 0.404944 -0.257620 -0.657516 0.303753 0.293179 0.373008 0.245500 0.244604 0.239402 0.236895 0.225606 0.217066 0.229051 0.253344
chargesum: 0.00000
title: Mulliken charges with hydrogens summed into heavy atoms:
elementType: S O O O O N C C C C C C C C C
charge: 1.006653 -0.286263 -0.534539 -0.480307 -0.281496 -0.275283 -0.037202 0.109189 0.030821 0.027830 0.041922 0.026905 0.404944 0.204881 0.041945
polarizability: 1.69867422e+02 1.08818778e+01 1.38618800e+02 1.33250990e+01 -1.32899647e+01 1.13736565e+02
1716.lowfreq: -9.9650 -5.0165 0.0020 0.0023 0.0030 11.2953 27.8221 44.8943 49.8901
frequency: 27.7668 44.8641 49.8633 68.2478 93.0223 112.0645 122.4438 148.1216 202.6499 223.7103 230.4874 249.1230 251.1634 302.8219 350.2907 375.1315 404.1553 416.8352 447.4770 500.2940 524.0781 600.9762 639.9429 649.1267 679.9920 688.7524 697.4681 761.9951 798.7793 816.9406 831.4016 843.3821 932.6675 953.9213 967.7186 974.5882 981.9485 1005.0028 1006.8826 1030.3017 1045.7882 1081.1189 1094.6345 1125.2708 1155.2992 1174.0161 1182.4837 1277.9214 1308.9616 1321.4349 1364.6130 1383.6046 1393.2672 1439.0798 1453.2364 1456.5667 1462.9832 1484.3119 1574.1914 1604.4969 1636.3008 2993.3233 3030.7410 3088.5315 3094.3870 3120.7129 3140.3622 3153.3624 3163.3425 3174.0378 3187.4891 3525.5603
redmass: 4.6540 3.4312 3.8800 4.8794 5.4285 5.6005 5.3749 7.2652 2.1274 9.6632 2.2763 8.4064 4.7039 2.9051 7.0671 6.1919 2.8137 4.9157 7.2038 4.0259 1.1929 6.4814 4.8162 6.3754 3.4314 3.0714 9.8921 1.4399 1.3787 5.5458 3.9887 1.2501 1.3579 3.2813 9.9978 5.2297 1.4825 1.3441 4.4787 4.0595 2.0767 1.5706 2.1968 2.0269 1.6454 1.0605 1.1214 1.1181 1.2885 1.7725 1.4737 8.0250 1.2363 2.2939 1.9899 1.0958 1.0456 1.0519 5.7455 6.9719 9.3757 1.0362 1.0598 1.0972 1.1032 1.1062 1.0863 1.0894 1.0941 1.0990 1.0975 1.0785
irintensity: 1.1064 1.0658 0.7314 0.3730 4.1833 1.1530 2.3198 1.8564 13.1123 2.2525 0.3628 6.3615 1.9131 30.9778 3.6831 27.0782 0.3154 13.2915 84.6991 82.1453 108.7392 0.2199 54.8951 3.9600 58.2380 157.0241 17.0140 68.5446 11.9228 79.7351 30.0395 1.5158 3.0801 8.7540 72.4118 1.8465 1.2136 0.0475 1.1028 140.7166 20.5715 4.9895 55.7994 332.8378 3.9374 0.4811 3.7804 8.8447 3.6267 394.1899 99.1549 7.0698 23.1661 20.7676 15.2844 22.0779 16.0374 15.2343 1.0592 1.0310 182.0796 18.3027 30.4898 32.4322 0.6242 31.9445 2.0845 11.5389 3.5304 14.4369 11.2835 75.0237
temp: 298.150 k
press: 1.00000 atm
elementType: 16 8 8 8 8 7 6 6 6 6 6 6 6 6 6 1 1 1 1 1 1 1 1 1 1 1
symmnumber: 1
zpe: 500624.2 jmol-1
zpe.correction: 0.190678 hartree
zpe.thermalcorrener: 0.206387 hartree
zpe.thermalcorrenthalpy: 0.207331 hartree
zpe.thermalcorrgfe: 0.145986 hartree
zpe.sumelectzpe: -1101.968862 hartree
zpe.sumelectthermal: -1101.953153 hartree
zpe.sumelectthermalent: -1101.952208 hartree
zpe.sumelectthermalfe: -1102.013553 hartree
dipole: -0.1446 -4.4102 -2.7418
dipole: 5.1950
quadrupole: -71.9928 -99.7047 -97.9765
quadrupole: 6.4448 0.9024 -4.2582
quadrupole: 17.8985 -9.8134 -8.0851 6.4448 0.9024 -4.2582
hfenergy: -1102.1595392 hartree
pointgroup: C01 [X(C9H11N1O4S1)]
dipole: -0.1726347 -2.0009767 -0.3790154 debye
dipolederiv: 2.3507542 -0.1840485 -0.1903085 -0.1579278 1.7448215 0.0485664 -0.4834728 0.1976429 1.2470424 -1.7664178 0.5087093 0.158072 0.7567687 -0.624586 -0.0422416 0.3529932 -0.0695513 -0.4944758 -0.6876268 -0.0028776 0.044092 -0.0028245 -0.6367946 0.0551511 -0.0539643 0.1783584 -0.5737318 -0.6430999 -0.0980106 -0.0280199 -0.0519949 -0.597736 -0.0374005 0.1048729 -0.1506928 -0.5448232 -0.7487443 0.0699344 0.0999537 0.1625508 -0.4865843 0.1837201 0.1037313 0.2559234 -0.7078226 -1.5229431 0.4538136 -0.0703167 0.6347569 -1.0083165 0.0356242 -0.2375669 0.1548143 -0.587796 -0.0017462 0.1192885 -0.014055 0.1169419 -0.1389793 -0.0283686 -0.0317955 -0.097679 -0.0747611 -0.1045826 -0.1137082 0.1310436 -0.0224923 -0.1085497 0.0913733 -0.0968401 -0.0763191 -0.071903 -0.1187338 0.0441635 -0.0696451 -0.1378103 -0.1242928 -0.0802875 0.2010245 0.1074582 -0.0867147 -0.1213432 0.0377921 -0.0317921 -0.0162188 -0.0354323 -0.1662676 0.0584714 -0.0694525 0.0544101 0.003318 0.0083823 0.1672952 0.0677728 -0.1028517 0.0490345 0.0759881 -0.0168679 -0.0184519 0.0326822 0.1266057 0.013345 0.1165391 0.0190917 -0.0624872 0.0061366 -0.0672852 -0.0123982 2.0860383 -0.6724088 -0.2233984 -1.0427701 1.0133878 -0.2547703 -0.0263876 -0.5279424 0.9374026 0.8496482 -0.201206 0.0787875 -0.4592029 0.4701165 0.0531922 0.3003025 -0.0852928 0.2983836 -0.1439357 -0.0007803 -0.0756981 0.0527578 -0.0402583 -0.0959798 -0.1425031 -0.0300341 -0.0457207 0.1281584 -0.0176874 -0.0606002 -0.0157939 0.1288647 -0.0084592 -0.0623662 0.0009964 0.1363385 0.1760642 -0.0158645 0.0062039 0.014699 0.1154561 0.0642811 -0.0112398 0.0376278 0.0815136 0.139893 0.1102259 0.0491133 0.1789801 0.1951842 0.0246809 0.0150351 0.0285894 0.2692332 0.0884335 -0.0377815 -0.0223297 -0.051707 0.0596637 0.1038316 -0.0129794 0.0994276 -0.0154135 -0.0085638 -0.0660985 -0.0957374 -0.073605 0.1027401 0.0131769 -0.1004643 0.0104766 0.0326736 0.0101178 -0.1185929 0.014512 -0.1263501 0.0285022 0.0470732 0.0132445 0.0449423 0.1042324 -0.0291026 -0.0936227 0.0200383 -0.0118612 -0.0368451 0.0279554 -0.0476315 0.1049693 0.0512033 -0.0339608 0.0772528 0.0391102 0.0826244 0.0334466 -0.0630754 0.029876 -0.0940528 -0.0729243 -0.066996 0.1172421 -0.0606153 0.1109222 -0.0111325 0.0534321 -0.0987736 0.0548313 0.0930841 0.0554994 -0.0833364 0.0257879 -0.1273032 -0.0207237 0.0603044 0.0680526 0.0854879 0.0235724 0.0771893 0.0326137 0.0951621 0.0025484 0.0618078 -0.0720596 0.0762562 -0.0763757 -0.0221532 unknown
polarizability: 171.9186521|11.709806|125.3138195|4.9048043|-19.3236093|124.9903152 unknown
InChI: InChI=1S/C9H11NO4S/c1-2-14-9(11)10-15(12,13)8-6-4-3-5-7-8/h3-7,10H,2H2,1H3
charge 0 multiplicity 1
26 atoms
S  -0.315196 1.583268 -0.41332
O  3.011631 -0.521674 -1.301589
O  -0.84585 2.472636 -1.663857
O  0.180101 2.26604 0.962838
O  1.638988 -0.709737 0.611587
N  1.094607 0.679897 -1.206276
C  -1.56876 0.220265 -0.04358
C  -1.454802 -0.489149 1.161746
C  -2.587501 0.035921 -0.991423
C  -2.44459 -1.465111 1.423705
C  -3.563272 -0.946742 -0.705192
C  -3.488537 -1.692148 0.49545
C  1.894749 -0.2199 -0.515754
C  3.970916 -1.507537 -0.707861
C  4.973985 -0.804099 0.208078
H  -0.630322 -0.295407 1.852579
H  -2.622513 0.646209 -1.899479
H  1.398077 1.089428 -2.096582
H  -2.394227 -2.045651 2.350272
H  -4.377959 -1.122721 -1.414847
H  -4.2498 -2.449774 0.7107
H  3.390739 -2.271784 -0.161521
H  4.452779 -1.954723 -1.591787
H  5.720493 -1.534647 0.571936
H  5.509318 -0.004257 -0.331959
H  4.465449 -0.367203 1.083836
