program: Gaussian 09
title: 000286218
version: EM64L-G09RevD.01
frameworkgroup: C1[X(C15H15NO4S)]
method: RPBEPBE
basis: SDD
operation: Freq
keyword: #p
keyword: freq=noraman
keyword: PBEPBE/SDD
title: #p freq=noraman PBEPBE/SDD
converged: YES YES NO NO
title: Mulliken charges:
elementType: S O O O O N C C C C C C C C C C C C C C C H H H H H H H H H H H H H H H
charge: 1.007116 -0.480199 -0.545313 -0.255755 -0.278455 -0.687275 -0.061904 -0.185273 -0.255636 0.452603 -0.375808 -0.367093 0.293553 0.271395 -0.328123 -0.339401 -0.799622 0.334826 -0.346182 -0.358053 -0.537419 0.303802 0.290818 0.351571 0.245694 0.244340 0.277244 0.217567 0.229198 0.232387 0.244098 0.258201 0.245425 0.226025 0.224719 0.250927
chargesum: 0.00000
title: Mulliken charges with hydrogens summed into heavy atoms:
elementType: S O O O O N C C C C C C C C C C C C C C C
charge: 1.007116 -0.480199 -0.545313 -0.255755 -0.278455 -0.335704 -0.061904 0.118529 0.035182 0.452603 -0.130114 -0.122753 0.293553 0.271395 -0.050879 -0.121834 -0.093939 0.334826 -0.087981 -0.112628 0.164253
polarizability: 3.02024549e+02 8.96502663e+00 1.73385425e+02 -4.54290433e+00 -1.76993167e+01 1.85811186e+02
1716.lowfreq: -8.2785 -2.0061 -0.0004 0.0005 0.0017 2.2297 16.6098 25.7374 32.7803
frequency: 16.5822 25.4508 32.6860 39.2823 58.1441 65.3822 94.6602 101.3993 129.2070 133.1348 144.3791 188.5803 201.2605 221.7060 229.7191 235.7035 265.9205 291.4355 302.9524 319.7484 369.1457 383.9304 406.1213 413.0059 417.4096 445.0836 463.1246 483.6233 505.4588 512.9277 576.0303 586.9964 620.2587 627.4353 659.4061 680.7385 705.4982 755.4790 761.7810 775.8674 811.4639 814.6396 822.6649 840.1999 842.1767 857.2829 938.6462 955.6482 959.3039 979.3651 982.4872 990.2046 991.1403 991.8993 999.4768 1049.1879 1049.2538 1064.8440 1112.0476 1118.8406 1122.0240 1155.7751 1182.4354 1188.0352 1207.3613 1218.0690 1241.5090 1299.6066 1302.0906 1332.8639 1378.2645 1382.9271 1391.9904 1398.9468 1428.4452 1437.1932 1468.7189 1471.0744 1471.1733 1471.5934 1474.8268 1499.5263 1553.5662 1588.4464 1592.7985 1595.2007 1619.5237 2966.0287 2980.9873 3057.0567 3063.6610 3093.0869 3129.4827 3132.3918 3137.2328 3141.8151 3156.8775 3164.2140 3167.5606 3177.0435 3184.7070 3510.9338
redmass: 5.1093 3.4416 1.0621 3.8810 5.2840 5.8907 4.9427 5.6279 5.4528 6.6880 5.6978 4.1155 9.2086 1.4323 4.8381 4.6478 5.3176 5.6792 4.6010 5.0569 5.2370 4.1090 2.8468 2.9028 9.4891 5.0924 4.4171 1.4957 2.9118 2.6403 5.4109 6.1155 6.9439 6.8714 5.4706 4.0712 3.2146 4.2349 6.0901 4.9743 1.5899 4.1639 1.5511 6.0112 1.2787 1.5917 1.3945 1.3376 9.7194 1.3972 8.2053 3.1216 1.4003 1.8190 2.7160 1.9043 1.9436 2.4123 1.2594 1.3929 1.2914 1.3192 1.2688 1.1410 2.0505 3.0641 3.0633 1.2588 1.3129 2.4640 5.1827 7.3476 2.7419 1.2211 4.1600 1.1715 1.0498 1.0871 1.1089 2.1979 1.0686 2.4848 9.4349 7.8364 6.0356 6.9840 6.2484 1.0328 1.0390 1.1043 1.0947 1.1001 1.0894 1.0992 1.0893 1.0906 1.0883 1.0959 1.0940 1.0973 1.0952 1.0786
irintensity: 1.1112 1.4173 0.4620 0.5047 0.2447 0.0782 1.0818 6.5140 2.9350 1.3674 8.2299 2.1192 2.8607 4.1106 7.3597 3.0021 23.6704 8.5652 1.6854 6.1841 20.7504 3.1685 0.0946 2.7934 31.1782 80.3074 4.8263 76.7155 63.9842 48.4492 1.9159 7.3993 0.4686 13.2407 229.2521 21.7781 9.7075 15.1833 6.5010 11.5934 6.2764 152.2079 14.6193 23.8966 5.8237 47.0286 0.3341 1.6115 67.9897 1.2374 64.0762 2.3575 2.0301 3.6240 14.2216 42.7366 11.4411 91.1253 0.1810 9.5376 10.4863 11.6268 228.7422 6.2785 88.3052 2.3450 136.6172 3.7347 6.8055 493.3116 33.2538 2.9986 13.6989 16.4288 49.8315 2.3767 14.7094 40.6132 21.8864 19.9529 14.0364 45.5475 96.1202 56.5419 11.4870 2.5455 187.0882 66.3462 24.0819 43.0129 17.8624 14.5647 24.4082 12.9492 12.3733 9.2453 0.1102 6.3908 10.7504 6.5583 7.1833 30.8768
temp: 298.150 k
press: 1.00000 atm
elementType: 16 8 8 8 8 7 6 6 6 6 6 6 6 6 6 6 6 6 6 6 6 1 1 1 1 1 1 1 1 1 1 1 1 1 1 1
symmnumber: 1
zpe: 705524.5 jmol-1
zpe.correction: 0.268720 hartree
zpe.thermalcorrener: 0.289763 hartree
zpe.thermalcorrenthalpy: 0.290707 hartree
zpe.thermalcorrgfe: 0.215921 hartree
zpe.sumelectzpe: -1332.609657 hartree
zpe.sumelectthermal: -1332.588615 hartree
zpe.sumelectthermalent: -1332.587671 hartree
zpe.sumelectthermalfe: -1332.662457 hartree
dipole: 2.4069 -4.6987 -4.3176
dipole: 6.8201
quadrupole: -90.8224 -141.4303 -126.2126
quadrupole: 21.2352 -9.1873 -3.2515
quadrupole: 28.6660 -21.9418 -6.7242 21.2352 -9.1873 -3.2515
hfenergy: -1332.8783775 hartree
pointgroup: C01 [X(C15H15N1O4S1)]
dipole: -0.8881008 2.4726365 -0.5450224 debye
polarizability: 301.6655097|2.7493898|160.9466101|11.2024632|3.0108983|198.6090405 unknown
InChI: InChI=1S/C15H15NO4S/c1-11-3-9-14(10-4-11)21(18,19)16-15(17)12-5-7-13(20-2)8-6-12/h3-10,16H,1-2H3
charge 0 multiplicity 1
36 atoms
S  1.798113 -1.662392 -1.002878
O  1.916442 -2.979105 -0.076218
O  2.002468 -1.758288 -2.615112
O  -6.036049 1.051768 0.185506
O  0.058502 -0.660607 1.35977
N  0.072784 -0.966441 -0.942169
C  2.888847 -0.284491 -0.329523
C  3.096704 -0.197007 1.055198
C  3.495261 0.559429 -1.272949
C  4.610418 1.703077 0.607113
C  3.968663 0.814984 1.511832
C  4.36033 1.562567 -0.783999
C  -1.986962 -0.172055 0.138276
C  -0.559585 -0.616436 0.252351
C  -2.744463 -0.103169 1.341132
C  -2.608086 0.19721 -1.080962
C  5.569256 2.763055 1.116532
C  -4.698781 0.661219 0.093353
C  -4.084734 0.303825 1.323391
C  -3.955103 0.613373 -1.114133
C  -6.730076 1.425395 -1.052308
H  2.58239 -0.874498 1.741444
H  3.307897 0.423588 -2.342854
H  -0.41451 -1.128799 -1.830376
H  4.147494 0.91705 2.588032
H  4.849388 2.240018 -1.49313
H  -2.25034 -0.375252 2.279043
H  -2.04337 0.203083 -2.020695
H  5.608362 3.635063 0.441166
H  5.284313 3.118308 2.12187
H  6.596968 2.357618 1.19065
H  -4.679567 0.355196 2.239925
H  -4.406337 0.901657 -2.067745
H  -6.758724 0.579513 -1.76556
H  -6.253071 2.302815 -1.529666
H  -7.752042 1.68273 -0.739411
