program: Gaussian 09
title: 000286261
version: EM64L-G09RevD.01
frameworkgroup: C1[X(C19H20Cl2N4)]
method: RPBEPBE
basis: SDD
operation: Freq
keyword: #p
keyword: freq=noraman
keyword: PBEPBE/SDD
title: #p freq=noraman PBEPBE/SDD
converged: YES YES NO NO
title: Mulliken charges:
elementType: Cl Cl N N N N C C C C C C C C C C C C C C C C C C C H H H H H H H H H H H H H H H H H H H H
charge: -0.063628 -0.064087 -0.129221 -0.460569 -0.071238 -0.090687 0.454205 -0.420897 -0.420184 -0.370437 -0.347336 0.331915 -0.555040 -0.554128 0.464842 -0.023991 -0.409215 -0.417429 -0.527829 0.288537 0.185625 -0.338041 -0.348959 -0.402599 -0.782013 0.237797 0.275988 0.238706 0.275239 0.222064 0.221516 0.291355 0.264608 0.291497 0.264784 0.224861 0.271856 0.256165 0.306624 0.244063 0.234810 0.212418 0.272201 0.232989 0.232862
chargesum: 0.00000
title: Mulliken charges with hydrogens summed into heavy atoms:
elementType: Cl Cl N N N N C C C C C C C C C C C C C C C C C C C
charge: -0.063628 -0.064087 -0.129221 -0.153945 -0.071238 -0.090687 0.454205 0.092888 0.093761 -0.148373 -0.125820 0.331915 0.000923 0.002153 0.464842 -0.023991 -0.184354 -0.145573 -0.271664 0.288537 0.185625 -0.093978 -0.114148 -0.190181 -0.043961
polarizability: 6.13702261e+02 4.35778587e+00 1.55814840e+02 -1.87114297e+01 -2.13762212e+01 2.21815656e+02
1716.lowfreq: -6.9630 -3.3175 -1.0853 0.0017 0.0025 0.0027 14.5983 18.8631 28.8660
frequency: 14.5255 18.8433 28.8147 34.6626 39.4845 64.8832 74.4860 82.0876 86.2832 91.1906 119.1661 123.5561 138.4721 170.8114 186.7189 216.9269 230.0188 240.3268 270.9841 289.9503 336.2855 352.4599 375.0388 398.4865 413.2237 423.2213 425.5344 443.4471 450.3221 496.1717 502.3807 512.7653 542.7940 557.1612 592.2053 600.6596 605.7274 621.3982 633.5983 645.8073 651.4275 673.7114 699.3620 737.3977 768.9688 783.5633 802.3348 816.2940 823.5158 829.8439 854.1110 866.3440 870.1230 876.5099 920.1461 933.4480 937.6323 948.3051 949.8865 960.7973 973.3960 985.1651 995.2219 996.3239 1005.9342 1027.4577 1046.1484 1048.1346 1111.5277 1126.4391 1138.4821 1158.6535 1173.2676 1177.4579 1194.4753 1210.5890 1221.5306 1232.0821 1255.0545 1259.2869 1270.3282 1282.2518 1292.9190 1303.6802 1315.0431 1344.3004 1351.1127 1354.3193 1356.1048 1373.6507 1387.0845 1391.7994 1397.8324 1437.6445 1439.4600 1442.5081 1451.9430 1466.9591 1467.2775 1469.0067 1484.3002 1492.8162 1523.1185 1531.4196 1551.7370 1576.0773 1587.2680 1630.1462 1644.3491 2941.8359 2979.3533 2981.2311 2983.0598 3054.4675 3055.3244 3055.8547 3074.4022 3080.9856 3115.1246 3122.7979 3135.8115 3141.4990 3143.3172 3145.2257 3160.3333 3161.3820 3165.2496 3165.7859 3597.0308
redmass: 7.4682 5.9317 8.2346 7.3266 8.1669 6.0091 4.7003 4.9485 1.0764 4.5748 4.3801 3.6279 4.5763 4.4697 4.2633 4.4196 4.6817 4.7394 3.8883 3.9600 3.0922 3.9797 3.1372 4.9225 3.7283 3.3213 3.3233 3.1776 3.3967 2.7657 3.9981 2.7023 3.5109 2.9509 1.2449 4.8379 4.3181 4.8869 6.6176 3.4600 3.6854 5.4337 4.1823 3.4607 3.3790 6.5354 1.3361 1.7315 1.6581 4.9247 2.7687 2.5093 1.8402 1.8437 1.8633 2.1886 1.6134 2.1203 1.3812 2.7100 1.5204 1.4455 2.7936 2.4748 1.8629 2.5399 1.4902 1.8634 1.9833 1.5783 1.6250 1.1733 1.3573 1.8446 1.1710 2.5660 1.5534 1.3272 2.2514 1.4895 2.2448 2.3527 1.2531 1.1928 1.5822 1.8715 2.0695 1.5408 1.8383 3.9332 2.0229 2.1851 1.2555 1.5119 1.1236 1.7118 2.6781 1.2017 1.4285 1.0455 2.7899 1.2094 2.8926 4.5303 7.2855 7.7888 5.9677 6.4616 7.5324 1.0856 1.0683 1.0393 1.0682 1.0581 1.0979 1.0582 1.0936 1.0931 1.0892 1.0963 1.0877 1.0900 1.1101 1.1071 1.0931 1.0941 1.0961 1.0946 1.0812
irintensity: 0.3344 1.1253 0.8111 1.2861 0.5110 3.8384 1.9284 1.0561 0.3612 5.7829 1.6570 4.9908 0.5116 2.4046 6.4995 3.8548 12.3198 1.9173 3.3433 5.7819 1.2710 3.8318 5.1467 5.3139 5.4110 0.9506 11.4836 11.9279 13.4798 8.4254 6.4695 34.3655 4.5309 2.5837 82.0667 16.5588 24.9053 3.0782 1.8015 18.9332 8.3211 1.0288 5.9289 4.1056 1.4953 5.1753 11.6746 24.7456 66.2672 5.3293 0.8137 20.8408 0.6201 46.8607 96.4081 2.1347 5.6327 13.5778 1.2947 4.3979 12.0756 11.2889 0.8106 0.7169 4.2794 15.8943 4.3132 8.7461 18.0753 23.7615 13.0662 17.9018 14.3061 44.9706 168.4360 13.8718 24.5310 110.8877 3.1915 5.6005 45.5997 14.8701 4.4327 22.4896 29.3205 28.7796 21.6961 389.9156 16.6277 6.1968 46.8635 30.7512 5.8037 24.5037 3.5455 25.7881 70.5675 34.1905 8.6428 18.2693 6.6645 4.2030 380.5405 10.5695 130.2389 16.9712 336.3725 335.5871 2.7782 62.5103 41.1452 57.3368 30.8825 22.9881 19.2073 14.6866 1.7906 7.2656 14.8764 5.1467 6.7611 22.6119 26.1114 11.1557 8.2039 22.7727 10.3227 27.8014 42.4861
temp: 298.150 k
press: 1.00000 atm
elementType: 17 17 7 7 7 7 6 6 6 6 6 6 6 6 6 6 6 6 6 6 6 6 6 6 6 1 1 1 1 1 1 1 1 1 1 1 1 1 1 1 1 1 1 1 1
symmnumber: 1
zpe: 929305.6 jmol-1
zpe.correction: 0.353954 hartree
zpe.thermalcorrener: 0.377651 hartree
zpe.thermalcorrenthalpy: 0.378595 hartree
zpe.thermalcorrgfe: 0.296286 hartree
zpe.sumelectzpe: -1873.357205 hartree
zpe.sumelectthermal: -1873.333507 hartree
zpe.sumelectthermalent: -1873.332563 hartree
zpe.sumelectthermalfe: -1873.414873 hartree
dipole: -1.2877 -0.4701 -2.6004
dipole: 2.9396
quadrupole: -159.0532 -166.3386 -145.5690
quadrupole: 3.0675 -30.6960 -15.1473
quadrupole: -2.0663 -9.3517 11.4179 3.0675 -30.6960 -15.1473
hfenergy: -1873.7111584 hartree
pointgroup: C01 [X(C19H20Cl2N4)]
dipole: -0.4961756 -0.6998756 -0.7755781 debye
polarizability: 614.1539136|-9.5618906|155.4479259|-10.4814904|20.5760368|221.7309173 unknown
InChI: InChI=1S/C19H20Cl2N4/c1-14-23-18-7-4-16(12-19(18)24-14)22-13-15-2-5-17(6-3-15)25(10-8-20)11-9-21/h2-7,12-13,24H,8-11H2,1H3
charge 0 multiplicity 1
45 atoms
Cl -7.090497 -2.767593 0.11152
Cl -6.980836 2.535566 -1.085016
N  -5.145922 -0.074185 -0.137416
N  6.193469 -0.80618 -1.158631
N  7.011646 0.17101 0.733888
N  1.418172 0.041052 -0.036252
C  -3.764281 -0.055763 0.117109
C  -6.117575 -0.247007 0.953171
C  -5.672883 0.062224 -1.503948
C  -3.247281 -0.173132 1.447863
C  -2.808873 0.080541 -0.94705
C  5.063074 -0.370374 -0.449133
C  -6.275532 -1.693821 1.44364
C  -5.705312 1.503149 -2.033183
C  -0.922491 -0.027582 0.633646
C  5.598684 0.239409 0.738135
C  -1.86449 -0.153671 1.69024
C  -1.432452 0.088847 -0.690898
C  3.686029 -0.430169 -0.717507
C  2.80607 0.111264 0.25675
C  7.333673 -0.46033 -0.40926
C  4.716722 0.809938 1.684305
C  3.33452 0.739761 1.439035
C  0.51415 -0.023475 0.916389
C  8.723808 -0.777874 -0.867398
H  -5.829755 0.37925 1.822126
H  -7.095081 0.136686 0.618234
H  -5.070542 -0.547475 -2.207389
H  -6.688854 -0.36494 -1.532259
H  -3.921727 -0.277951 2.301831
H  -3.142058 0.176509 -1.984315
H  -5.313812 -2.182683 1.654239
H  -6.948222 -1.754401 2.313564
H  -4.751567 2.032052 -1.895607
H  -6.028838 1.540453 -3.085221
H  -1.504009 -0.244039 2.723234
H  -0.712489 0.187868 -1.510044
H  3.261347 -0.876639 -1.621333
H  6.194158 -1.286801 -2.056272
H  5.114166 1.303379 2.576495
H  2.640202 1.208075 2.145514
H  0.790672 -0.109544 1.989458
H  9.434288 -0.405214 -0.11449
H  8.880272 -1.866826 -0.984756
H  8.958454 -0.296963 -1.835711
