program: Gaussian 09
title: 000024107
version: EM64L-G09RevD.01
frameworkgroup: C1[X(C18H17ClN2O)]
method: RPBEPBE
basis: SDD
operation: Freq
keyword: #p
keyword: freq=noraman
keyword: PBEPBE/SDD
title: #p freq=noraman PBEPBE/SDD
converged: YES YES NO NO
title: Mulliken charges:
elementType: Cl O N N C C C C C C C C C C C C C C C C C C H H H H H H H H H H H H H H H H H
charge: -0.057944 -0.241354 -0.053253 -0.220188 -0.364677 -0.420709 0.245802 -0.545408 0.364006 0.245817 -0.478331 0.251838 0.111760 -0.373678 -0.315893 -0.390011 -0.343099 -0.256079 -0.245993 -0.639192 -0.159467 -0.245159 0.278995 0.213507 0.228281 0.213485 0.242157 0.263021 0.214969 0.244463 0.290323 0.234918 0.246129 0.230005 0.228173 0.234343 0.281491 0.228038 0.258914
chargesum: 0.00000
title: Mulliken charges with hydrogens summed into heavy atoms:
elementType: Cl O N N C C C C C C C C C C C C C C C C C C
charge: -0.057944 -0.241354 -0.053253 -0.220188 -0.085682 0.021079 0.245802 -0.089767 0.364006 0.245817 -0.000340 0.251838 0.111760 -0.129215 -0.025570 -0.155093 -0.096970 -0.026074 -0.017820 0.104680 -0.159467 0.013755
polarizability: 2.49833775e+02 1.28662191e+01 2.33626096e+02 -9.95735185e+00 1.07150280e+01 1.63666025e+02
1716.lowfreq: -7.4831 -0.0018 -0.0013 -0.0012 2.7163 6.5435 42.7521 50.4242 62.4431
frequency: 42.7322 50.4194 62.4292 86.8900 95.3394 112.3586 128.1599 145.5548 189.7977 202.2456 223.0729 239.0230 257.3862 287.0206 307.7647 334.0299 339.3996 374.8173 385.7285 404.9281 433.1632 448.5746 457.4143 477.1172 507.1040 516.8139 523.7165 570.4889 575.7386 623.4464 632.1580 658.0734 689.2580 727.8135 739.8891 740.0112 751.3556 780.8876 810.7482 820.1347 853.4159 873.7663 882.5475 898.9342 914.4961 930.5949 944.7420 955.6672 968.8103 988.0715 1001.0106 1036.9926 1052.5132 1054.6829 1084.3188 1091.2135 1111.1040 1123.1005 1126.0009 1133.3261 1138.3754 1166.8111 1175.0554 1201.9584 1205.0820 1215.3472 1225.9704 1247.9087 1252.9691 1275.0691 1275.5430 1305.6586 1320.9631 1325.8845 1341.8399 1355.0189 1371.5157 1383.5513 1385.4908 1403.1528 1420.1047 1440.7917 1443.4841 1465.6169 1467.4036 1469.6125 1482.5607 1491.2597 1497.4528 1572.2280 1591.0910 1594.9747 1608.9302 1616.1172 2861.2879 2872.3040 2970.5607 2981.1175 2983.1790 3033.2167 3038.1481 3065.2403 3075.0959 3114.7917 3118.9179 3121.0121 3139.6233 3151.5301 3160.1224 3161.3927 3175.8566
redmass: 4.6174 5.5981 7.6380 2.5987 6.0159 2.5953 1.4923 3.6832 4.4590 5.0842 3.5247 2.9620 5.3453 4.0520 5.1354 3.7651 4.4308 4.0231 5.0329 4.3685 3.2044 3.7585 3.6245 4.7270 3.8895 5.0448 4.1669 4.0342 4.4214 4.8094 4.3493 5.0654 4.4565 4.7687 2.7825 4.0369 2.2097 2.4482 2.1769 1.6492 3.2269 1.8253 2.1132 1.8663 3.5687 2.3665 1.3592 1.4551 2.3355 1.3245 2.1219 2.5108 3.1522 2.2645 2.0715 2.6875 1.6047 2.1699 2.0919 2.5517 1.8005 1.7762 1.0668 1.3892 1.4474 1.7344 1.6339 1.5328 1.6102 1.8266 1.4603 1.8724 1.7901 1.8395 1.5409 1.6491 4.9333 1.5858 6.0712 3.4663 1.2148 1.8303 1.3025 1.3677 1.2147 1.4930 1.1005 2.5098 1.0621 8.0168 7.3254 7.0111 8.1424 6.4413 1.0706 1.0705 1.0825 1.0604 1.0380 1.0910 1.0985 1.0887 1.0958 1.0866 1.0894 1.1016 1.0928 1.0885 1.0920 1.1004 1.0969
irintensity: 0.1116 0.7533 2.1904 0.9228 2.1679 1.4666 0.6384 0.1746 0.7936 1.3610 1.1028 4.3034 4.7593 1.1467 2.3114 3.4925 4.7792 4.8609 0.6514 3.5514 2.8167 5.2361 8.7347 7.1211 4.6574 6.2446 27.5619 5.7090 1.5899 1.8783 19.9049 1.5804 4.3774 0.6690 26.6009 49.0574 15.9212 5.9035 11.8027 33.5229 28.9258 8.5273 2.6067 4.4029 2.3343 0.7995 0.7219 1.7012 13.8076 0.0673 2.3013 5.3804 23.5274 4.8142 24.6804 19.0232 14.9197 52.7371 25.8849 17.0538 16.9514 10.8592 1.0655 1.6086 11.4968 8.6489 0.8437 15.9975 2.0645 12.7798 24.6648 15.3776 33.6681 38.1535 1.8707 8.2208 10.2818 14.0640 0.7886 27.1916 32.5713 2.2414 18.0118 104.0416 8.7784 70.3787 8.5722 17.7403 22.7803 6.9957 80.7808 9.0061 276.5459 1.8204 39.2912 86.6756 10.0670 28.4568 44.3154 37.5129 24.2552 15.1746 22.3704 13.1125 2.7019 2.0168 25.3167 6.7115 0.8904 30.3914 4.9834
temp: 298.150 k
press: 1.00000 atm
elementType: 17 8 7 7 6 6 6 6 6 6 6 6 6 6 6 6 6 6 6 6 6 6 1 1 1 1 1 1 1 1 1 1 1 1 1 1 1 1 1
symmnumber: 1
zpe: 810688.3 jmol-1
zpe.correction: 0.308775 hartree
zpe.thermalcorrener: 0.327142 hartree
zpe.thermalcorrenthalpy: 0.328087 hartree
zpe.thermalcorrgfe: 0.262409 hartree
zpe.sumelectzpe: -1339.343770 hartree
zpe.sumelectthermal: -1339.325403 hartree
zpe.sumelectthermalent: -1339.324458 hartree
zpe.sumelectthermalfe: -1339.390136 hartree
dipole: 0.0399 1.9122 -0.0950
dipole: 1.9150
quadrupole: -120.6891 -159.8658 -126.7773
quadrupole: -11.3811 -4.8252 6.8389
quadrupole: 15.0883 -24.0884 9.0001 -11.3811 -4.8252 6.8389
hfenergy: -1339.652545 hartree
pointgroup: C01 [X(C18H17Cl1N2O1)]
dipole: -0.0079553 0.7463564 -0.1026163 debye
polarizability: 248.6975608|12.4366749|235.6662741|-12.7030808|3.936997|162.7620612 unknown
InChI: InChI=1S/C18H17ClN2O/c1-20-16-7-6-13(19)10-15(16)18-14-5-3-2-4-12(14)8-9-21(18)11-17(20)22/h2-7,10,18H,8-9,11H2,1H3
charge 0 multiplicity 1
39 atoms
Cl -0.409343 4.444407 -1.204028
O  -2.713506 -3.214158 0.452048
N  0.107119 -1.719703 -0.81516
N  -2.602195 -0.892137 0.673843
C  0.25282 -0.693558 0.265584
C  0.910938 -1.418438 -2.025029
C  1.715872 -0.318248 0.489963
C  2.405137 -1.490715 -1.672835
C  -0.666073 0.521414 0.022445
C  2.734068 -0.674953 -0.432023
C  -1.31337 -1.99816 -1.158889
C  -2.069608 0.372289 0.248299
C  -2.2380 -2.108772 0.061206
C  2.057794 0.40572 1.66054
C  -0.176664 1.767225 -0.435942
C  4.073524 -0.292473 -0.161403
C  -2.93738 1.481211 0.083379
C  3.391046 0.77814 1.923705
C  4.407935 0.427667 1.003383
C  -3.640869 -0.926586 1.727556
C  -1.063437 2.842219 -0.621136
C  -2.440154 2.726884 -0.35056
H  -0.11115 -1.180253 1.192966
H  0.658865 -0.419209 -2.459735
H  0.667598 -2.178385 -2.789866
H  3.014453 -1.148359 -2.531296
H  2.669379 -2.550125 -1.487172
H  -1.360943 -2.971186 -1.67515
H  -1.734976 -1.217659 -1.8409
H  1.266894 0.680503 2.369441
H  0.896074 1.900267 -0.603275
H  4.858971 -0.567938 -0.876327
H  -4.008718 1.370646 0.277566
H  3.637084 1.334429 2.834658
H  5.448097 0.713959 1.194538
H  -3.38138 -0.222217 2.534817
H  -3.686109 -1.955138 2.117917
H  -4.639277 -0.669466 1.325801
H  -3.109715 3.58076 -0.485531
