program: Gaussian 09
title: 000286168
version: EM64L-G09RevD.01
frameworkgroup: C1[X(C7H12Cl3NO2S)]
method: RPBEPBE
basis: SDD
operation: Freq
keyword: #p
keyword: freq=noraman
keyword: PBEPBE/SDD
title: #p freq=noraman PBEPBE/SDD
converged: YES YES NO NO
title: Mulliken charges:
elementType: Cl Cl Cl S O O N C C C C C C C H H H H H H H H H H H H
charge: 0.124108 0.111796 0.103848 0.217080 -0.200765 -0.179693 0.153971 -0.341395 -0.355531 -0.641996 -0.355639 -0.329501 -0.588248 -0.681280 0.348645 0.213934 0.213858 0.266351 0.273097 0.297683 0.296349 0.197032 0.215521 0.222238 0.207458 0.211079
chargesum: 0.00000
title: Mulliken charges with hydrogens summed into heavy atoms:
elementType: Cl Cl Cl S O O N C C C C C C C
charge: 0.124108 0.111796 0.103848 0.217080 -0.200765 -0.179693 0.153971 0.007250 0.072261 -0.102548 0.238393 0.083052 -0.588248 -0.040505
polarizability: 1.84426415e+02 4.14327616e+00 1.15414104e+02 7.31586638e+00 -2.52922185e+00 1.25070601e+02
1716.lowfreq: -17.9251 -7.2802 -4.4566 -0.0029 -0.0028 -0.0024 10.5624 22.8305 33.0084
frequency: -13.9200 22.5958 32.7642 44.2313 53.8292 60.9122 92.9767 107.6351 144.0529 166.3639 190.5524 207.3756 227.4956 241.7054 246.5536 260.7341 272.5856 304.6383 339.0992 361.5798 460.1896 483.2552 520.4390 560.5888 613.4904 627.8627 660.6501 735.6425 737.4271 770.9153 811.1845 841.6902 869.6899 915.6060 923.7079 1014.4905 1040.8779 1061.9101 1064.3812 1089.3226 1108.9583 1190.8675 1194.1047 1213.6187 1216.9335 1233.2594 1276.1299 1286.3097 1295.4237 1306.7845 1320.2821 1356.9210 1391.6709 1430.0966 1444.4331 1451.0628 1454.3200 1471.9965 1479.3654 1484.9862 2967.5726 2975.0517 2980.6106 3010.5523 3018.6096 3030.2250 3040.3116 3044.0659 3072.1507 3078.1633 3095.5330 3124.6786
redmass: 3.2370 6.7467 5.7027 5.7867 13.0802 2.6362 3.7282 5.0360 11.1752 12.4567 11.5389 3.2464 1.9768 1.6412 7.7492 2.5962 11.4607 11.5041 4.9105 16.5184 3.4685 4.0336 5.5601 6.1003 3.7252 7.7998 9.6741 5.7658 1.2195 5.8801 1.7452 6.2428 1.4182 2.3864 1.4299 2.7529 3.5294 1.2504 2.0386 3.9115 2.0939 1.4456 1.3053 1.5447 1.8685 1.3120 1.2316 1.2457 1.2271 1.2398 1.6583 1.5708 1.2128 1.3255 2.7100 1.0940 1.0744 1.0630 1.0425 1.0729 1.0599 1.0364 1.0611 1.0807 1.0740 1.0818 1.1011 1.0613 1.1012 1.0992 1.1093 1.1040
irintensity: 0.2933 1.9987 2.0652 0.3471 1.2759 0.4305 0.6457 1.2453 0.9035 1.1659 0.4755 1.6591 0.6038 0.0784 2.5134 1.9024 1.5803 6.5955 3.0979 3.3492 7.5254 14.7547 19.6620 19.0849 4.6856 29.6551 133.3806 93.0716 5.2961 35.3528 4.7420 28.4613 6.3539 21.7260 18.7418 3.6445 19.7565 6.5773 1.5547 12.0332 0.3159 7.1206 20.5285 51.1330 21.3765 0.7251 14.2800 15.6489 4.7944 1.2163 67.1542 0.8285 11.6911 87.7760 62.2636 10.4216 7.4177 5.4780 13.6332 15.3366 9.5212 44.5631 43.3479 5.8245 10.5800 15.1702 18.1618 12.0298 72.2042 40.8539 17.9620 0.2501
temp: 298.150 k
press: 1.00000 atm
elementType: 17 17 17 16 8 8 7 6 6 6 6 6 6 6 1 1 1 1 1 1 1 1 1 1 1 1
symmnumber: 1
zpe: 491821.0 jmol-1
zpe.correction: 0.187325 hartree
zpe.thermalcorrener: 0.204112 hartree
zpe.thermalcorrenthalpy: 0.205056 hartree
zpe.thermalcorrgfe: 0.139593 hartree
zpe.sumelectzpe: -2256.160401 hartree
zpe.sumelectthermal: -2256.143614 hartree
zpe.sumelectthermalent: -2256.142669 hartree
zpe.sumelectthermalfe: -2256.208132 hartree
dipole: -3.9371 0.0808 0.3224
dipole: 3.9511
quadrupole: -116.0660 -120.4870 -111.9256
quadrupole: -8.8055 5.5771 2.4645
quadrupole: 0.0935 -4.3275 4.2340 -8.8055 5.5771 2.4645
hfenergy: -2256.3477255 hartree
pointgroup: C01[X(C7H12Cl3N1O2S1)]
dipole: 1.5495646 -0.0189326 -0.121966 debye
dipolederiv: -0.347801 0.0957017 -0.2648906 0.0858507 -0.227142 0.1420407 -0.252575 0.1684806 -0.4640184 -0.1584358 -0.0293513 -0.0188365 -0.0563728 -0.4516959 -0.2620927 -0.0356162 -0.2857759 -0.4671939 -0.878387 0.0035003 0.2456034 0.0086435 -0.2032849 0.0047773 0.2881437 0.0212489 -0.2359432 -0.2956412 -0.0995323 -0.0705799 -0.1193909 -0.1696998 0.0625896 -0.0819327 0.0797556 -0.0833554 -0.4824785 0.1694069 -0.1389415 0.0642337 -0.4450881 -0.2138503 -0.2705089 -0.0799519 -0.5741961 -0.6839649 0.18655 -0.307035 0.2946176 -0.4022853 0.0534476 -0.1946882 -0.0538283 -0.4643517 0.9070256 -0.4052319 0.3913684 -0.4268412 0.6704058 0.2446015 0.3510452 0.2782372 0.8136662 0.1820851 0.1153521 -0.0615501 0.0944764 -0.1072582 -0.0990764 -0.1093935 -0.2187145 -0.1943608 -0.0101577 0.0151011 0.0225338 -0.0702572 0.0541184 -0.0154034 -0.139718 -0.0562615 0.1143522 0.251161 0.1268582 0.1713669 0.2108126 0.140357 0.0474157 0.3396116 0.0912404 0.1527398 0.0138621 0.0429124 0.0319324 0.0305457 0.0447699 -0.0454145 0.2125265 -0.1786746 0.0531902 0.0393172 -0.010851 0.0157568 -0.0113411 0.051004 -0.0272482 0.0753939 -0.0083203 0.1348882 1.2896315 -0.0725642 0.0323356 0.026057 0.9402296 0.1401117 -0.01016 0.1433226 1.20451 -0.0573723 0.0106184 0.0341053 0.0412054 0.069154 0.0050622 0.013688 0.0044459 0.0996487 0.0906619 -0.0769516 0.0113124 -0.0978699 0.1113594 -0.0529421 0.009257 0.0656402 0.0506957 0.0714331 0.0099478 0.01001 0.0339782 -0.0053021 0.0789372 0.0634207 0.1348218 -0.0728022 -0.079402 -0.084425 -0.0832494 -0.034314 0.0070212 -0.0829197 -0.0560235 -0.1106155 -0.0212506 0.0405432 -0.0178354 -0.0150575 -0.0650471 0.0166467 0.0653874 -0.0472105 0.0354966 -0.0854811 -0.0773232 0.0712196 0.010103 0.0460301 -0.0698767 -0.0626549 -0.0563156 -0.0699728 0.0280332 0.1174094 -0.0247529 0.0574863 0.0147106 -0.0017979 0.0457909 0.0197357 0.0503549 0.084176 -0.0001621 -0.0080946 -0.022793 0.0027788 0.0634064 -0.0518864 -0.0243268 -0.0262241 0.1230844 0.0357126 -0.0120935 0.0578172 -0.0034964 -0.014329 0.0922945 0.0374873 0.1264407 -0.103455 0.0083205 -0.0568382 -0.078613 -0.0694098 -0.0033295 -0.0654015 -0.1105667 -0.096912 -0.0290861 -0.0415418 0.0988971 0.0223857 0.1598464 -0.1021102 -0.0296881 0.0334325 -0.0235944 0.0956742 0.0008292 -0.0477047 -0.0476542 -0.1079025 0.0176436 -0.1010507 -0.1054379 -0.1065692 -0.0583045 0.0646752 0.0001607 -0.0049165 -0.0515434 0.0170837 0.1271727 0.0507315 0.1159296 -0.10086 unknown
polarizability: 184.2839275|-2.7379572|117.4561476|8.5494245|4.5578194|123.1710453 unknown
InChI: InChI=1S/C7H12Cl3NO2S/c1-2-3-4-14-6(5-11(12)13)7(8,9)10/h6H,2-5H2,1H3
charge 0 multiplicity 1
26 atoms
Cl -0.080036 -1.882601 1.822352
Cl -1.19739 -2.512908 -0.926049
Cl -2.897446 -1.054118 1.115685
S  1.119207 0.000529 -0.760737
O  -2.099274 2.429008 0.574838
O  -3.511173 2.168066 -1.195522
N  -2.4730 1.855305 -0.512515
C  -0.644141 0.116426 -0.066927
C  3.55851 0.986161 0.268075
C  2.081568 0.831214 0.667429
C  -1.585905 0.744318 -1.110441
C  4.319008 -0.350201 0.093734
C  -1.14796 -1.246335 0.442392
C  5.809357 -0.132076 -0.242346
H  -0.597148 0.800382 0.801505
H  3.635766 1.587085 -0.660086
H  4.052878 1.579983 1.06469
H  1.968646 0.188748 1.556981
H  1.608066 1.81152 0.847762
H  -1.004546 1.250166 -1.899586
H  -2.277815 0.029015 -1.580091
H  4.226898 -0.943463 1.025613
H  3.840155 -0.95058 -0.704118
H  6.338185 -1.094516 -0.363869
H  6.320277 0.435451 0.55843
H  5.924613 0.437421 -1.183804
