program: Gaussian 09
title: 000286208
version: EM64L-G09RevD.01
frameworkgroup: C1[X(C23H20O2S)]
method: RPBEPBE
basis: SDD
operation: Freq
keyword: #p
keyword: freq=noraman
keyword: PBEPBE/SDD
title: #p freq=noraman PBEPBE/SDD
converged: YES YES NO NO
title: Mulliken charges:
elementType: S O O C C C C C C C C C C C C C C C C C C C C C C C H H H H H H H H H H H H H H H H H H H H
charge: 0.871367 -0.571700 -0.534412 -0.050829 0.526956 -0.687912 0.279051 -0.258746 -0.241899 0.448583 -0.373036 -0.361149 -0.392918 -0.400265 -0.404207 -0.308518 -0.800577 0.474686 -0.223092 -0.227564 -0.236859 -0.389190 -0.403967 -0.239147 -0.238999 -0.238536 0.290338 0.289097 0.277010 0.242192 0.241627 0.297510 0.261559 0.262862 0.246410 0.243500 0.228923 0.228850 0.232344 0.231672 0.233276 0.254195 0.230921 0.230983 0.228369 0.231240
chargesum: 0.00000
title: Mulliken charges with hydrogens summed into heavy atoms:
elementType: S O O C C C C C C C C C C C C C C C C C C C C C C C
charge: 0.871367 -0.571700 -0.534412 -0.050829 0.526956 -0.397574 0.279051 0.030352 0.035110 0.448583 -0.130844 -0.119522 -0.095407 -0.138706 -0.141345 -0.062108 -0.099304 0.474686 0.009252 0.004108 -0.003582 -0.134995 -0.173047 -0.008164 -0.010630 -0.007296
polarizability: 4.36507583e+02 3.31406487e+01 3.15680381e+02 2.78044621e+01 1.51568347e+01 2.09499934e+02
1716.lowfreq: -23.0302 -7.3831 -4.6051 -0.0024 -0.0020 0.0003 4.4167 8.0848 23.6949
frequency: -22.9235 7.6251 23.6645 24.8855 32.4293 37.5272 50.6121 69.0052 70.5036 98.9411 125.6442 134.1245 162.8548 181.8223 188.4897 201.2510 220.6916 233.4373 262.3664 286.6131 298.2362 310.9478 369.8621 385.0521 402.2468 405.2274 406.7948 416.1695 419.8355 448.4380 486.0197 495.0192 520.8788 574.9938 592.4947 609.9193 613.6652 622.5866 631.5248 636.9257 676.7133 696.0035 707.7895 708.9352 747.8854 766.8475 769.4875 773.2817 780.2897 790.6931 828.8105 846.9195 849.7054 850.0522 859.5808 902.8551 904.9641 930.8281 934.5654 959.7388 978.9750 981.0246 982.1395 987.4146 988.3352 989.6301 995.3209 995.8820 998.8880 1010.4553 1022.5545 1026.4927 1049.1108 1053.6513 1070.6332 1082.1022 1091.6185 1116.7318 1173.9681 1174.3717 1181.8381 1191.2002 1194.4681 1218.1324 1220.1004 1230.9290 1293.6140 1296.3147 1315.2247 1325.4106 1337.4519 1349.1174 1373.1507 1380.9791 1387.9712 1389.6799 1397.8576 1430.0447 1440.7743 1471.4895 1473.1919 1473.4541 1478.7609 1485.0077 1545.7456 1580.4882 1585.1708 1595.6091 1596.6562 1606.8774 1609.2962 1631.0063 2979.9993 3062.3193 3090.6491 3100.0944 3118.1934 3119.5858 3127.6045 3130.0307 3132.4091 3133.8925 3134.3278 3141.4304 3145.6745 3152.4839 3154.5969 3156.0802 3160.3038 3166.6945 3168.0676 3174.9597
redmass: 1.0411 5.1630 4.9543 3.8562 3.8888 5.2948 4.2801 6.0220 5.2417 4.8989 6.0787 4.6420 3.9311 5.1623 5.4455 7.0308 8.3324 4.7619 3.9442 3.5680 4.5453 5.3461 3.6854 5.8288 2.7804 2.8800 2.9579 4.8561 5.3868 7.3973 3.1749 3.0022 3.9719 5.7536 6.3459 5.6095 6.3868 6.9481 4.0883 5.0859 4.8514 1.6696 2.0640 2.5502 1.5546 5.1338 4.2128 2.0409 2.5981 3.9416 1.3952 4.1049 1.2998 1.2520 1.2418 2.1732 4.5537 1.4205 1.6105 1.3113 1.3862 1.4052 1.4036 5.6862 5.1351 1.4184 3.6344 1.4553 1.3114 1.1720 2.6897 2.1974 1.5932 2.4858 2.2923 1.6087 1.7123 1.2797 1.0606 1.0534 1.1528 1.1164 1.1292 2.8856 1.6751 1.8683 1.2684 1.7394 1.3966 1.8470 1.2933 1.6174 6.7270 6.0317 6.2427 3.0559 1.2204 2.2475 2.3036 1.0974 1.4653 1.4711 2.2885 2.2892 7.3389 5.4978 5.9839 6.4552 6.5253 6.0166 5.7846 4.8941 1.0386 1.0950 1.1000 1.0930 1.0885 1.0872 1.0848 1.0865 1.0887 1.0889 1.0879 1.0914 1.0925 1.0960 1.0967 1.0955 1.0966 1.1015 1.1017 1.0932
irintensity: 0.3099 1.7633 0.6881 0.0638 0.2109 1.3498 0.3888 0.9075 0.4008 2.2013 1.2571 0.1765 0.3964 4.4922 0.5979 0.0614 14.3001 1.7436 0.9705 4.6906 2.5405 4.9495 1.7186 13.2672 0.0983 0.2213 2.9043 15.8531 11.6945 97.0526 6.4595 27.9821 85.0082 3.0211 52.3498 2.6799 0.6121 0.5530 5.4451 18.8054 6.0140 51.3279 23.2951 9.1596 107.2670 53.6219 7.1830 49.5148 21.5122 46.4060 29.8285 6.0429 0.0680 1.6133 0.9854 16.7164 60.3810 2.6107 2.1761 0.4912 0.3831 1.2058 0.7874 0.7657 1.9560 1.2790 7.5402 7.5213 0.0925 35.6290 11.8852 5.9283 26.8190 32.9305 14.2206 9.2479 6.9086 7.6471 0.1600 0.0233 17.4035 3.2394 8.7592 8.4520 17.7764 26.0350 2.7169 0.1373 3.4476 23.1338 0.0286 51.5463 0.1994 0.0557 4.4188 9.4275 14.3632 6.7577 15.6242 16.3389 20.3939 21.3937 11.7662 7.2179 122.4077 10.2710 13.9760 4.8498 3.0326 2.8899 3.6998 142.4108 30.4321 18.5439 15.0629 13.9236 11.3961 40.3241 1.0185 0.7056 14.5734 9.6559 1.8612 14.8664 15.0912 23.1909 25.0317 4.9613 12.2355 39.9902 21.6014 15.5979
temp: 298.150 k
press: 1.00000 atm
elementType: 16 8 8 6 6 6 6 6 6 6 6 6 6 6 6 6 6 6 6 6 6 6 6 6 6 6 1 1 1 1 1 1 1 1 1 1 1 1 1 1 1 1 1 1 1 1
symmnumber: 1
zpe: 937579.1 jmol-1
zpe.correction: 0.357105 hartree
zpe.thermalcorrener: 0.380665 hartree
zpe.thermalcorrenthalpy: 0.381609 hartree
zpe.thermalcorrgfe: 0.299679 hartree
zpe.sumelectzpe: -1434.951838 hartree
zpe.sumelectthermal: -1434.928278 hartree
zpe.sumelectthermalent: -1434.927334 hartree
zpe.sumelectthermalfe: -1435.009264 hartree
dipole: 0.2615 2.7688 -5.7483
dipole: 6.3857
quadrupole: -123.9485 -144.3756 -170.4429
quadrupole: -0.1513 -8.0238 8.6731
quadrupole: 22.3072 1.8800 -24.1873 -0.1513 -8.0238 8.6731
hfenergy: -1435.3089431 hartree
pointgroup: C01 [X(C23H20O2S1)]
dipole: 0.3576041 1.392771 -2.0601237 debye
polarizability: 428.1139468|22.8649359|308.1822562|55.8184126|31.2182974|225.3916946 unknown
InChI: InChI=1S/C23H20O2S/c1-19-12-16-23(17-13-19)26(24,25)18-22(21-10-6-3-7-11-21)15-14-20-8-4-2-5-9-20/h2-18H,1H3
charge 0 multiplicity 1
46 atoms
S  1.627563 -0.84155 1.839386
O  0.777671 -2.152467 1.32417
O  2.033171 -0.649294 3.417818
C  3.256005 -0.833862 0.866131
C  -0.422694 0.920262 0.721166
C  0.805354 0.764459 1.317074
C  -0.851074 2.346401 0.500198
C  4.384428 -0.274091 1.484194
C  3.289043 -1.439917 -0.399202
C  5.690377 -0.883371 -0.519162
C  5.605025 -0.299252 0.772595
C  4.520717 -1.453684 -1.090127
C  -1.286655 -0.193971 0.323849
C  -0.824899 3.276338 1.573558
C  -1.243855 2.796207 -0.789479
C  -2.591385 -0.056032 -0.083768
C  7.014479 -0.933303 -1.25996
C  -3.494454 -1.153029 -0.45975
C  -1.190676 4.624412 1.364315
C  -1.601556 4.145863 -0.998002
C  -1.578709 5.064424 0.077836
C  -3.125046 -2.529853 -0.383754
C  -4.804674 -0.83063 -0.919703
C  -4.03396 -3.53683 -0.760509
C  -5.713318 -1.840036 -1.298656
C  -5.330935 -3.199362 -1.221829
H  1.45701 1.591306 1.614262
H  4.309174 0.139778 2.495565
H  2.388835 -1.902194 -0.817559
H  6.502586 0.133638 1.229311
H  4.575877 -1.917664 -2.081824
H  -0.840384 -1.19029 0.421821
H  -0.540474 2.931897 2.574239
H  -1.245455 2.092556 -1.628969
H  -3.029068 0.95116 -0.129079
H  7.551559 -1.876649 -1.041539
H  6.870392 -0.884685 -2.353407
H  7.677353 -0.102127 -0.963532
H  -1.176567 5.327346 2.204454
H  -1.892343 4.481009 -1.999756
H  -1.860555 6.110543 -0.085012
H  -2.131822 -2.812615 -0.018671
H  -5.104664 0.223328 -0.977407
H  -3.736393 -4.589031 -0.691579
H  -6.715433 -1.57039 -1.649868
H  -6.03407 -3.987652 -1.512744
