program: Gaussian 09
title: 000286155
version: EM64L-G09RevD.01
frameworkgroup: C1[X(C13H20N2O2)]
method: RPBEPBE
basis: SDD
operation: Freq
keyword: #p
keyword: freq=noraman
keyword: PBEPBE/SDD
title: #p freq=noraman PBEPBE/SDD
converged: YES YES NO NO
title: Mulliken charges:
elementType: O O N N C C C C C C C C C C C C C H H H H H H H H H H H H H H H H H H H H
charge: -0.297721 -0.276678 -0.400943 -0.589968 0.281156 -0.470535 -0.719817 -0.728370 0.482685 -0.345716 -0.429557 0.232703 -0.377808 -0.322609 0.176772 -0.257115 -0.667773 0.215236 0.250381 0.225864 0.207241 0.238227 0.202138 0.220651 0.220221 0.288220 0.257630 0.273772 0.231927 0.214943 0.264162 0.265925 0.232249 0.215718 0.211753 0.222849 0.252188
chargesum: 0.00000
title: Mulliken charges with hydrogens summed into heavy atoms:
elementType: O O N N C C C C C C C C C C C C C
charge: -0.297721 -0.276678 -0.112723 -0.058565 0.281156 -0.004919 -0.048485 -0.085361 0.482685 -0.113789 -0.214614 0.232703 -0.113646 -0.056684 0.176772 0.190853 0.019017
polarizability: 2.83603766e+02 -9.22534150e+00 1.50762319e+02 9.05623320e+00 5.67073527e+00 1.06623295e+02
1716.lowfreq: -2.2818 0.0007 0.0009 0.0010 7.7001 16.1103 26.4965 37.5402 51.8508
frequency: 26.0320 37.5207 51.8355 57.5511 64.6808 94.1318 112.3926 124.3363 180.7763 205.7684 218.4582 232.6439 241.3155 278.6990 283.5297 297.0103 318.0657 331.9440 354.6799 372.8755 415.1736 416.9076 425.5086 463.8655 475.3978 493.0947 510.8965 573.9249 611.1965 620.3536 634.1223 676.3432 730.2618 735.1475 751.5684 793.8350 816.9787 819.3680 836.6996 845.0719 898.1812 913.4008 934.2210 964.6098 971.5972 983.6785 990.0225 1003.3611 1009.8848 1047.2430 1057.0224 1093.4546 1095.7512 1129.7174 1153.6788 1179.4626 1184.8845 1215.7686 1255.8610 1261.6269 1282.0573 1292.2346 1315.1751 1322.4048 1348.3291 1358.9391 1371.3365 1382.0628 1390.1411 1391.7372 1443.8990 1453.8904 1458.9033 1462.5982 1465.6083 1469.9084 1480.9966 1485.0626 1485.9315 1486.4746 1531.2091 1573.2215 1612.4090 1631.1734 1635.3493 2960.6116 2969.1344 2980.6605 2989.8777 3024.2692 3054.8517 3067.3563 3073.6681 3081.2452 3083.7419 3088.8245 3100.7587 3111.3992 3114.5486 3146.1627 3169.2594 3173.9119 3432.2585 3551.1112 3560.6080
redmass: 4.1769 3.0661 3.8474 3.2226 3.9236 5.2195 4.9089 3.0072 1.7521 1.3060 1.3041 4.1033 1.1624 3.1220 2.5885 1.2211 3.3458 3.0102 2.5096 2.7063 3.0435 2.6993 2.3377 2.4292 1.6555 2.2995 2.5408 2.9429 5.1583 1.5234 6.4745 4.1156 3.2964 3.6859 4.7006 3.0712 1.5063 1.2870 1.7876 3.4870 1.8904 1.8896 1.4286 1.7416 1.3500 1.3490 3.5239 1.4273 2.5060 1.8732 3.3403 2.7081 2.1393 1.4572 1.6579 1.7435 1.1905 2.4749 1.8933 2.4559 1.1173 1.6178 1.6504 2.0135 1.5290 1.2947 1.2558 2.3193 1.2368 1.3711 3.8838 1.1082 1.0745 1.0441 1.0962 1.0699 1.5399 1.0555 1.1383 1.0944 3.0537 4.4479 8.8523 6.5595 1.0998 1.0365 1.0669 1.0382 1.0362 1.0589 1.0988 1.0987 1.0978 1.0939 1.0981 1.1031 1.0999 1.0897 1.1051 1.0880 1.0945 1.0948 1.0449 1.0762 1.0970
irintensity: 1.0660 0.2829 1.5652 0.0216 0.2156 0.3192 0.5853 0.8450 16.7391 14.2299 12.0226 2.7202 0.6905 4.4939 5.4337 0.2052 13.3155 5.0068 2.5349 5.0041 2.2097 11.2730 9.5778 1.1970 76.3567 42.7429 9.2464 16.7422 9.5703 209.6632 6.5696 29.7282 18.0236 2.4008 14.9217 3.7775 0.4018 4.0656 66.3738 6.8430 0.3226 2.6911 0.8298 1.0670 0.7461 0.2674 14.7035 0.3235 17.2249 107.1953 331.1687 12.6871 29.8926 17.0812 79.6949 20.5982 226.1957 117.6290 52.4986 263.6439 0.3380 51.3937 27.5352 31.2106 30.8534 10.4736 24.2500 93.0779 25.9409 17.8623 2.4968 42.7258 1.7550 14.7687 5.0211 1.5369 7.5804 29.5542 10.5189 12.5459 181.8559 60.4193 390.8588 352.1646 35.7414 27.5345 82.5675 16.5671 27.7683 46.7468 44.4036 6.3608 83.1174 14.2057 41.6513 6.1792 23.5382 20.0419 35.8464 2.1860 19.1230 2.6729 2.5851 38.6347 0.3488
temp: 298.150 k
press: 1.00000 atm
elementType: 8 8 7 7 6 6 6 6 6 6 6 6 6 6 6 6 6 1 1 1 1 1 1 1 1 1 1 1 1 1 1 1 1 1 1 1 1
symmnumber: 1
zpe: 817879.1 jmol-1
zpe.correction: 0.311514 hartree
zpe.thermalcorrener: 0.330162 hartree
zpe.thermalcorrenthalpy: 0.331106 hartree
zpe.thermalcorrgfe: 0.263958 hartree
zpe.sumelectzpe: -766.036889 hartree
zpe.sumelectthermal: -766.018241 hartree
zpe.sumelectthermalent: -766.017296 hartree
zpe.sumelectthermalfe: -766.084444 hartree
dipole: -4.6526 3.0817 1.2723
dipole: 5.7238
quadrupole: -76.9653 -102.2705 -105.6086
quadrupole: 3.0254 1.0652 -2.8430
quadrupole: 17.9828 -7.3224 -10.6604 3.0254 1.0652 -2.8430
hfenergy: -766.3484024 hartree
pointgroup: C01 [X(C13H20N2O2)]
dipole: 1.8120385 0.9774246 0.9123131 debye
polarizability: 281.3564314|-9.2617289|122.4591654|21.2460834|20.9615373|137.1737833 unknown
InChI: InChI=1S/C13H20N2O2/c1-4-17-12(16)10-5-7-11(8-6-10)15-9-13(2,3)14/h5-8,15H,4,9,14H2,1-3H3
charge 0 multiplicity 1
37 atoms
O  -3.985075 0.44891 0.412619
O  -3.498179 -1.039648 -1.325114
N  2.35066 0.038903 1.374641
N  5.572597 -0.801531 -0.416005
C  4.459655 0.126174 -0.083265
C  3.514796 -0.689064 0.863049
C  3.73533 0.493326 -1.396017
C  4.949229 1.416233 0.636248
C  1.035351 -0.060665 0.926324
C  0.649135 -0.878197 -0.181914
C  0.015698 0.681372 1.606553
C  -1.704363 -0.213873 0.104719
C  -0.69584 -0.950149 -0.572986
C  -1.323065 0.607182 1.202507
C  -3.102285 -0.331117 -0.360443
C  -5.417711 0.41109 0.004522
C  -5.700576 1.440587 -1.094609
H  4.119615 -1.034502 1.727584
H  3.194339 -1.595937 0.325001
H  3.456276 -0.420702 -1.949539
H  4.391159 1.104289 -2.045971
H  2.821452 1.076413 -1.191807
H  5.473351 1.166332 1.580156
H  5.657656 1.968583 -0.008334
H  4.109976 2.096597 0.875003
H  2.507627 0.646435 2.179344
H  6.195126 -1.005574 0.375171
H  6.102762 -0.52461 -1.249461
H  1.398561 -1.448994 -0.736668
H  0.292966 1.313804 2.460014
H  -0.993611 -1.578321 -1.41954
H  -2.092335 1.177545 1.730604
H  -5.661278 -0.610459 -0.337336
H  -5.962044 0.641366 0.935107
H  -6.782333 1.455871 -1.325733
H  -5.401047 2.453204 -0.7726
H  -5.154174 1.182325 -2.017023
