program: Gaussian 09
title: 000286148
version: EM64L-G09RevD.01
frameworkgroup: C1[X(C7H4N2O3)]
method: RPBEPBE
basis: SDD
operation: Freq
keyword: #pfreq=noraman
keyword: PBEPBE/SDD
title: #p freq=noraman PBEPBE/SDD
converged: YES YES NO YES
title: Mulliken charges:
elementType: O O O N N C C C C C C C H H H H
charge: -0.391093 -0.192934 -0.190008 0.027330 0.007122 0.431944 -0.464074 0.168933 -0.376332 0.302650 -0.318769 -0.279478 0.317511 0.296792 0.270558 0.389848
chargesum: 0.00000
title: Mulliken charges with hydrogens summed into heavy atoms:
elementType: O O O N N C C C C C C C
charge: -0.001245 -0.192934 -0.190008 0.027330 0.007122 0.431944 -0.146563 0.168933 -0.079541 0.302650 -0.048211 -0.279478
polarizability: 1.69796340e+02 -1.82460102e+00 1.04886916e+02 -1.59215173e-02 -1.48318111e-03 3.76763774e+01
1716.lowfreq: -6.2294 -0.0009 -0.0007 0.0005 6.4007 7.7227 56.6041 79.1799 121.4641
frequency: 56.6031 79.1775 121.4637 194.6890 208.8980 242.6108 321.6890 372.2576 413.1619 451.1523 460.8123 507.2526 516.7348 563.4948 596.3939 612.8016 704.1127 719.1363 740.8540 750.3428 848.1956 917.5043 920.9375 981.8941 1059.2463 1108.2468 1158.6444 1185.8539 1211.4319 1254.1197 1272.7805 1378.1937 1398.2405 1441.8501 1467.5491 1582.7523 1623.2081 2166.4418 3169.3076 3197.6655 3200.0922 3520.1336
redmass: 12.6581 10.1569 11.4197 5.5451 8.2504 6.8950 12.9389 6.9534 4.1851 1.1415 10.0016 4.5864 7.8114 5.4068 8.1304 5.6215 5.6192 6.3260 3.9689 11.6811 1.4525 6.2073 1.5023 1.3454 2.1448 1.7120 1.4459 2.8052 10.3848 2.2812 1.5242 11.8000 8.9692 3.7429 2.9904 8.4352 6.9063 12.6206 1.0912 1.0931 1.0959 1.0661
irintensity: 0.0034 6.9698 8.8731 0.3841 0.1576 0.1035 0.6153 8.4542 1.2908 147.8718 0.4917 22.1166 1.3018 0.6791 4.7922 5.2965 17.3481 5.4503 2.3001 45.1770 36.7825 26.5714 32.5733 0.4101 25.1289 4.4637 142.6059 75.8569 262.0802 11.1874 17.5164 90.7102 55.2838 51.5304 67.6355 19.8045 16.6507 24.2276 1.4962 8.5813 6.6444 61.5777
temp: 298.150 k
press: 1.00000 atm
elementType: 8 8 8 7 7 6 6 6 6 6 6 6 1 1 1 1
symmnumber: 1
zpe: 267353.0 jmol-1
zpe.correction: 0.101829 hartree
zpe.thermalcorrener: 0.111818 hartree
zpe.thermalcorrenthalpy: 0.112762 hartree
zpe.thermalcorrgfe: 0.065701 hartree
zpe.sumelectzpe: -603.377055 hartree
zpe.sumelectthermal: -603.367066 hartree
zpe.sumelectthermalent: -603.366122 hartree
zpe.sumelectthermalfe: -603.413184 hartree
dipole: 1.9806 -0.9534 0.0013
dipole: 2.1981
quadrupole: -93.9871 -65.1731 -68.0446
quadrupole: 4.3508 0.0079 -0.0010
quadrupole: -18.2522 10.5618 7.6903 4.3508 0.0079 -0.0010
hfenergy: -603.4788844 hartree
pointgroup: C01 [X(C7H4N2O3)]
dipole: -0.7890772 -0.353922 -0.0005192 debye
dipolederiv: -0.4898453 0.6453108 0.0000215 0.5466655 -0.9314367 0.0000504 0.0000026 0.0000472 -0.397083 -0.7513332 0.1858455 -0.000005 0.1421261 -0.6187804 0.0000309 0.0000354 -0.0000749 -0.217289 -0.6858445 -0.1816363 -0.0000132 -0.1650939 -0.6769138 -0.000067 0.0000155 0.0000464 -0.215996 1.7655805 0.0333408 -0.0000112 0.0814608 1.1010037 0.0000334 0.0000506 0.0000364 0.1903811 -0.371173 -0.0484084 -0.0005172 0.0268783 -0.2174979 -0.000058 -0.0001576 -0.0000038 -0.2230315 -0.5371733 -0.094151 0.0000245 0.0580606 0.3264784 0.0000005 -0.0000621 0.00001 0.0777711 -0.0649052 0.4585969 0.0000046 -0.1512516 -0.172581 0.0000114 0.0000073 0.0000413 -0.1181077 0.390558 -0.7868524 0.0000099 -0.5639712 0.8546058 -0.0000308 -0.0001697 -0.0000162 0.0934677 -0.1552034 -0.2273024 0.0000135 0.0604192 -0.2064036 -0.0000029 -0.0000223 -0.0000401 -0.1382295 -0.1369836 -0.136437 0.0000586 0.2678792 -0.0191678 -0.0000337 -0.0000269 -0.0000391 0.0812422 0.1283438 0.2047244 0.0000249 -0.1169312 0.0789575 0.0000297 -0.0001403 -0.000013 -0.0920352 0.3934011 0.1169671 0.0004086 -0.0216368 -0.0753108 0.0000969 0.0003968 0.0000615 0.0277683 0.1383266 -0.0262587 -0.0000012 0.0034464 0.10693 -0.0000071 0.0000205 -0.0000182 0.1913487 0.1031529 0.050106 0.0000025 0.0184809 0.0889966 0. 0.0000243 0.0000128 0.1852767 0.0579613 -0.0548371 -0.0000159 -0.0461412 0.0103552 -0.0000018 0. -0.000009 0.1627821 0.2151374 -0.1390081 -0.0000046 -0.1403908 0.3507647 -0.000052 0.0000259 -0.0000413 0.3917342 unknown
polarizability: 169.847512|0.0709083|104.8357447|-0.0158757|0.0019123|37.6763774 unknown
InChI: InChI=1S/C7H4N2O3/c8-4-5-1-2-6(9(11)12)3-7(5)10/h1-3,10H
charge 0 multiplicity 1
16 atoms
O  -1.635186 2.131401 0.000054
O  3.431253 -1.091229 0.000024
O  3.253236 1.183012 0.000116
N  2.743324 -0.00045 0.000232
N  -4.157935 -0.431033 0.001207
C  1.255757 -0.120575 0.000136
C  0.495105 1.060498 0.000146
C  -0.911403 0.948937 0.000044
C  0.681052 -1.413509 0.000025
C  -1.527431 -0.344612 -0.000075
C  -0.718514 -1.514175 -0.00007
C  -2.960582 -0.418037 -0.000215
H  0.976137 2.040762 0.000234
H  1.326659 -2.293829 0.000018
H  -1.203823 -2.494203 -0.000154
H  -2.616449 1.974743 -0.000024
