program: Gaussian 09
title: 000286191
version: EM64L-G09RevD.01
frameworkgroup: C1[X(C20H20N2O4S3)]
method: RPBEPBE
basis: SDD
operation: Freq
keyword: #p
keyword: freq=noraman
keyword: PBEPBE/SDD
title: #p freq=noraman PBEPBE/SDD
converged: NO YES NO NO
title: Mulliken charges:
elementType: S S S O O O O N N C C C C C C C C C C C C C C C C C C C C H H H H H H H H H H H H H H H H H H H H
charge: 0.866550 0.146218 0.146223 -0.250236 -0.250225 -0.527856 -0.534133 0.289313 0.289330 -0.057784 -0.057787 -0.383636 -0.384011 -0.260401 -0.260003 0.234013 0.234000 0.311577 0.311561 -0.298544 -0.298522 -0.260477 -0.260491 -0.391258 -0.391259 -0.675474 -0.675476 -0.685310 -0.685321 0.305230 0.305392 0.280997 0.280823 0.262627 0.262617 0.210229 0.213465 0.213440 0.210251 0.226699 0.224943 0.224958 0.226693 0.234016 0.210061 0.211453 0.234017 0.211448 0.210061
chargesum: 0.00000
title: Mulliken charges with hydrogens summed into heavy atoms:
elementType: S S S O O O O N N C C C C C C C C C C C C C C C C C C C C
charge: 0.866550 0.146218 0.146223 -0.250236 -0.250225 -0.527856 -0.534133 0.289313 0.289330 -0.057784 -0.057787 -0.078407 -0.078619 0.020596 0.020820 0.234013 0.234000 0.311577 0.311561 -0.035917 -0.035905 0.163217 0.163200 0.060383 0.060392 -0.019944 -0.019950 -0.685310 -0.685321
polarizability: 4.33942991e+02 -2.03625145e-01 3.95784610e+02 -6.74263726e-02 -2.19063834e+01 2.27843343e+02
1716.lowfreq: -4.2112 0.0011 0.0015 0.0016 1.0322 2.0867 7.7463 11.6056 12.8817
frequency: 7.5415 11.5960 12.8624 23.7008 24.5778 32.8477 46.7808 64.4911 65.5671 68.9352 72.3054 75.5556 83.1525 115.1412 117.9348 136.0697 145.7459 154.2375 160.2191 191.6978 193.1513 218.3141 227.6763 233.9659 235.7610 244.6499 244.8134 248.1476 257.8281 307.7147 333.6778 341.2481 362.6520 364.7057 364.7727 405.3335 415.5906 418.0791 418.5215 427.6239 430.1580 431.6330 463.3414 469.3762 478.4650 563.6449 569.0111 590.0099 599.3680 622.4353 634.4105 678.1719 682.9895 742.8412 743.7954 767.5027 767.6350 773.2275 785.7030 795.4721 817.3540 821.7108 896.1737 896.4224 900.7069 900.7857 904.8096 911.7479 920.8580 925.3345 934.0724 944.4250 950.4959 967.9125 969.3772 1051.5285 1052.1029 1058.9193 1065.6618 1128.7577 1134.5026 1136.1473 1137.2974 1143.0075 1143.0230 1214.3247 1216.5693 1232.7205 1232.7272 1252.2664 1256.6303 1262.0961 1264.7447 1291.9665 1292.0175 1312.6701 1312.7696 1369.6303 1371.0547 1386.5094 1387.1498 1396.8571 1396.9918 1409.0588 1413.0942 1465.3944 1467.1533 1475.5236 1475.9845 1481.8241 1482.3454 1482.3986 1482.6015 1491.8522 1492.0845 1569.0881 1571.0399 1591.8233 1594.9340 2160.0117 2165.3706 2958.2419 2958.3236 2980.6309 2980.6605 3009.7733 3009.7820 3020.7137 3020.7619 3057.1208 3057.1247 3085.3049 3085.3506 3089.3139 3089.3349 3155.3543 3156.8584 3163.7111 3165.9770 3176.5678 3177.0534
redmass: 7.0984 5.3697 8.9714 11.2333 10.0156 4.9666 4.5122 3.3922 4.0161 4.0713 4.3505 3.0544 2.7283 3.1960 6.3427 2.9545 7.1415 3.0740 4.1378 7.5713 8.4579 7.3184 3.3398 1.1382 1.4279 4.5403 4.6123 6.7814 8.1147 5.6845 8.9521 6.5035 7.0000 6.5204 6.5638 6.6295 9.4038 9.1123 8.9018 9.4793 7.1617 5.7580 4.1301 3.5068 7.4704 4.9344 4.9365 4.6456 4.7135 8.3167 8.2359 9.4841 9.6257 3.2715 3.3516 1.0910 1.0923 9.3053 6.5817 7.9261 1.4844 1.5183 1.1519 1.1475 1.9116 1.8258 1.5236 1.5148 6.6566 6.7545 10.2577 1.3611 1.3764 6.1510 6.1759 2.7339 2.8203 2.0705 2.0303 1.6329 1.9747 2.1408 1.7747 1.4547 1.4549 3.1000 3.0224 1.2491 1.2491 1.3703 1.3917 3.5801 3.4515 1.1030 1.1031 1.3714 1.3734 2.7212 2.5172 1.9458 2.0359 1.2823 1.2900 4.6523 4.6064 1.5938 1.4433 1.1994 1.2043 1.2694 1.0844 1.0474 1.2855 1.1593 1.1819 7.2848 7.0968 7.4785 7.5566 12.8742 12.8797 1.0552 1.0553 1.0365 1.0365 1.0602 1.0602 1.1068 1.1068 1.1016 1.1016 1.1035 1.1035 1.0988 1.0988 1.0887 1.0885 1.0928 1.0928 1.0953 1.0956
irintensity: 0.4937 0.5841 0.0318 0.1376 1.9524 0.2885 0.0145 0.1187 0.8674 0.4847 1.3705 0.1997 0.0526 2.2299 0.9608 1.0977 1.0612 6.6813 3.9269 5.1389 9.3168 1.1819 0.3603 0.0251 0.2775 0.4712 0.8021 1.2031 0.4364 7.1461 6.6854 3.0582 1.0556 1.8468 0.7383 11.5010 13.7233 0.0068 0.8459 19.8529 17.9536 2.6363 32.5220 10.3726 239.6191 0.3425 4.2900 45.6521 30.1225 0.2368 36.4125 58.7292 2.0130 0.5247 0.0887 9.4031 13.3206 50.0779 5.1123 83.4495 18.6444 27.6106 2.9582 3.8487 14.1603 13.5597 1.9724 29.6610 6.9963 12.7358 84.9591 0.4381 1.3174 119.6167 103.2690 37.4537 8.7959 84.1264 17.7094 111.7438 31.1959 13.6182 31.6492 0.4045 0.4929 155.1444 86.2425 0.5829 0.3628 56.0255 16.7527 170.9076 94.5400 0.0950 0.2565 3.6713 4.8838 16.1982 5.6580 0.0018 0.0685 15.7749 24.9210 7.4989 87.4952 182.5856 42.5617 19.6304 9.6507 69.1842 5.0075 3.1542 43.9760 0.1541 2.4485 5.7626 45.8274 1.0763 60.7597 1157.1064 1757.7481 7.1502 52.5439 18.3390 55.8136 1.6301 32.2054 15.9521 24.8635 0.3409 0.3255 56.9470 87.4869 26.0034 39.8456 0.2355 9.1802 10.6291 6.0694 16.4126 8.4654
temp: 298.150 k
press: 1.00000 atm
elementType: 16 16 16 8 8 8 8 7 7 6 6 6 6 6 6 6 6 6 6 6 6 6 6 6 6 6 6 6 6 1 1 1 1 1 1 1 1 1 1 1 1 1 1 1 1 1 1 1 1
symmnumber: 1
zpe: 946824.8 jmol-1
zpe.correction: 0.360627 hartree
zpe.thermalcorrener: 0.391733 hartree
zpe.thermalcorrenthalpy: 0.392677 hartree
zpe.thermalcorrgfe: 0.291143 hartree
zpe.sumelectzpe: -2376.422721 hartree
zpe.sumelectthermal: -2376.391615 hartree
zpe.sumelectthermalent: -2376.390671 hartree
zpe.sumelectthermalfe: -2376.492205 hartree
dipole: 0.0115 -6.9403 -7.7070
dipole: 10.3714
quadrupole: -160.9470 -199.9014 -210.6776
quadrupole: -0.0148 0.0574 18.1156
quadrupole: 29.5617 -9.3928 -20.1689 -0.0148 0.0574 18.1156
hfenergy: -2376.7833479 hartree
pointgroup: C01 [X(C20H20N2O4S3)]
dipole: 0.0102635 -2.5282367 3.2027772 debye
polarizability: 433.9427502|0.2985257|239.9038114|0.1083176|48.5782089|383.7243816 unknown
InChI: InChI=1S/C20H20N2O4S3/c1-3-9-25-19-7-5-15(11-17(19)21-13-27)29(23,24)16-6-8-20(26-10-4-2)18(12-16)22-14-28/h5-8,11-12H,3-4,9-10H2,1-2H3
charge 0 multiplicity 1
49 atoms
S  -0.002126 2.477571 0.396003
S  5.428769 -1.337729 -4.101439
S  -5.435681 -1.345052 -4.091973
O  4.924762 -1.045819 0.188441
O  -4.916852 -1.063119 0.196057
O  -0.005093 3.291687 -1.024325
O  -0.00205 3.203307 1.864803
N  3.770789 -0.195012 -2.105015
N  -3.773812 -0.201876 -2.098999
C  1.510742 1.343436 0.365251
C  -1.5108 1.33781 0.367758
C  2.046974 0.994889 -0.881083
C  -2.050026 0.990729 -0.877684
C  2.076679 0.959116 1.588832
C  -2.071066 0.948008 1.592218
C  3.797432 -0.252112 0.329048
C  -3.791795 -0.265902 0.334979
C  3.203599 0.180656 -0.909704
C  -3.203818 0.17244 -0.904598
C  3.2324 0.148305 1.56403
C  -3.223875 0.13302 1.56913
C  5.622168 -1.516815 1.409189
C  -5.60847 -1.539844 1.417869
C  6.813832 -2.356496 0.946289
C  -6.799372 -2.381542 0.956672
C  7.619113 -2.898373 2.147938
C  -7.59879 -2.929386 2.159537
C  4.502809 -0.700244 -2.928326
C  -4.507011 -0.707301 -2.921148
H  1.607288 1.365072 -1.812221
H  -1.61477 1.365144 -1.809219
H  1.644017 1.311047 2.530725
H  -1.636508 1.298843 2.53364
H  3.690717 -0.160104 2.507023
H  -3.677769 -0.179748 2.512831
H  4.918757 -2.118871 2.020417
H  5.95446 -0.638035 1.998962
H  -5.941201 -0.663856 2.011533
H  -4.901093 -2.141705 2.024694
H  7.459841 -1.734841 0.299658
H  6.443804 -3.191295 0.32327
H  -6.42921 -3.213367 0.329771
H  -7.449478 -1.75976 0.314283
H  8.477694 -3.49751 1.798689
H  6.997816 -3.547401 2.793291
H  8.015917 -2.076597 2.773038
H  -8.456874 -3.529966 1.811544
H  -7.995736 -2.110654 2.788523
H  -6.973306 -3.578542 2.800705
