program: Gaussian 09
title: 000286149
version: EM64L-G09RevD.01
frameworkgroup: C1[X(C15H14ClNO2)]
method: RPBEPBE
basis: SDD
operation: Freq
keyword: #p
keyword: freq=noraman
keyword: PBEPBE/SDD
title: #p freq=noraman PBEPBE/SDD
converged: YES YES NO NO
title: Mulliken charges:
elementType: Cl O O N C C C C C C C C C C C C C C C H H H H H H H H H H H H H H
charge: -0.050574 -0.205978 -0.208945 0.153805 -0.422255 -0.135080 0.534981 0.497833 -0.699005 -0.441562 -0.368564 -0.412671 -0.404011 -0.208888 -0.214203 -0.225491 -0.249241 -0.117560 -0.240753 0.258263 0.261807 0.246399 0.233246 0.241590 0.243505 0.255908 0.231451 0.242337 0.257575 0.256232 0.228016 0.229824 0.232009
chargesum: 0.00000
title: Mulliken charges with hydrogens summed into heavy atoms:
elementType: Cl O O N C C C C C C C C C C C C C C C
charge: -0.050574 -0.205978 -0.208945 0.153805 -0.163992 0.126727 0.534981 0.497833 0.022230 -0.198057 -0.112656 -0.181220 -0.161674 0.048687 0.042028 0.002525 -0.019416 -0.117560 -0.008744
polarizability: 2.26575334e+02 1.46398898e+01 1.54664055e+02 -1.03916234e+01 -8.85606807e+00 1.59569964e+02
1716.lowfreq: -11.9823 -9.5669 -2.8208 0.0013 0.0015 0.0017 23.8508 29.4876 41.8346
frequency: 23.3965 29.2381 41.8251 42.7897 58.8778 67.5594 124.8363 138.6857 179.5046 197.7882 205.6094 233.0162 274.1268 289.7148 317.9512 322.3690 360.9001 401.8064 407.6194 409.2409 489.4196 508.8470 541.6035 606.2215 613.2235 617.7836 631.0995 673.7374 688.3626 704.5667 721.6709 756.1485 793.1081 817.7883 829.4786 832.6155 851.7392 856.0121 917.3724 930.6766 953.2844 965.5645 977.8181 991.8357 997.5114 1000.0094 1028.8027 1038.8202 1071.8434 1074.0037 1096.9574 1106.5628 1126.4801 1175.2186 1185.2334 1187.5671 1197.3413 1204.6895 1217.5864 1235.9156 1265.6452 1289.0754 1301.7024 1319.5573 1353.4227 1375.4158 1383.2251 1390.4865 1396.6069 1432.0128 1441.6375 1468.3221 1474.7133 1476.7748 1485.7742 1584.8135 1593.8747 1596.2849 1614.0271 3000.4629 3007.8959 3067.8374 3102.0153 3112.7759 3119.1826 3127.1393 3129.7603 3138.4666 3139.1750 3149.7384 3166.2997 3168.6951 3171.8018
redmass: 4.0765 4.1797 6.2730 6.6530 10.4665 6.5992 4.6394 6.1829 7.9814 2.3728 1.4416 5.8823 3.4755 4.0661 5.7405 4.8523 5.0491 2.7856 3.6646 5.0612 3.5459 3.6554 3.4289 6.6324 5.0096 6.3188 6.2757 4.9584 6.4455 1.6850 3.4116 2.2956 4.8568 2.4893 1.3086 1.8572 1.2525 3.2916 1.6508 1.7580 1.4223 1.3770 1.4175 5.2915 1.3495 4.2103 2.3190 1.9043 1.9812 2.4449 1.8643 1.6024 1.9101 1.0536 1.1317 2.7356 1.1841 2.0347 2.3912 2.1683 1.9889 1.4369 1.3575 1.3648 1.2933 6.2636 5.5763 1.2527 2.6205 4.0966 2.1481 1.0625 1.8664 1.1976 2.2182 7.3389 5.8849 6.2575 6.0168 1.0354 1.0830 1.0869 1.1004 1.0996 1.0874 1.0859 1.0899 1.0894 1.0910 1.0958 1.1015 1.0951 1.0962
irintensity: 0.3932 0.1175 2.7222 0.5668 0.1749 1.6495 0.4661 0.3166 2.7951 0.7629 0.2986 0.2309 2.1559 1.0242 0.8464 0.7722 3.8594 0.1095 3.4175 9.6366 19.4805 17.4405 19.3315 0.9481 9.6968 0.2128 1.5429 2.5857 9.9919 42.1877 13.4620 51.7580 27.0585 17.1930 4.6148 25.4018 0.3809 20.5799 1.7022 1.8700 0.5285 0.0144 0.1213 2.0019 0.1148 42.7784 4.5695 9.3491 14.4028 36.7885 2.4733 16.3430 15.1667 0.0846 0.5986 2.0399 0.1414 0.3593 36.5647 26.6297 33.1638 19.6031 2.0097 4.7371 1.0362 0.6132 0.8731 21.1669 4.6070 100.5586 7.9537 9.1064 92.2961 7.9242 14.4870 0.8227 2.4651 9.7557 6.8926 12.1244 4.1136 3.7824 15.1929 10.0508 6.4531 1.5596 8.1156 7.7410 11.5069 33.0895 20.1341 4.9908 0.6079
temp: 298.150 k
press: 1.00000 atm
elementType: 17 8 8 7 6 6 6 6 6 6 6 6 6 6 6 6 6 6 6 1 1 1 1 1 1 1 1 1 1 1 1 1 1
symmnumber: 1
zpe: 665039.9 jmol-1
zpe.correction: 0.253300 hartree
zpe.thermalcorrener: 0.270729 hartree
zpe.thermalcorrenthalpy: 0.271674 hartree
zpe.thermalcorrgfe: 0.205064 hartree
zpe.sumelectzpe: -1243.816959 hartree
zpe.sumelectthermal: -1243.799530 hartree
zpe.sumelectthermalent: -1243.798586 hartree
zpe.sumelectthermalfe: -1243.865196 hartree
dipole: -1.9278 0.7990 -0.0120
dipole: 2.0869
quadrupole: -144.1403 -113.3202 -110.0573
quadrupole: 14.8923 -3.7358 -1.4469
quadrupole: -21.6344 9.1857 12.4487 14.8923 -3.7358 -1.4469
hfenergy: -1244.0702596 hartree
pointgroup: C01 [X(C15H14Cl1N1O2)]
dipole: 0.7450854 0.3347131 0.0833384 debye
polarizability: 227.8746871|-9.5105022|150.5243805|-12.1558467|6.4582574|162.4102863 unknown
InChI: InChI=1S/C15H14ClNO2/c1-11(17(18)19)15(12-5-3-2-4-6-12)13-7-9-14(16)10-8-13/h2-11,15H,1H3
charge 0 multiplicity 1
33 atoms
Cl 5.652004 0.502488 0.544933
O  -3.015788 -2.433707 0.720933
O  -2.617331 -2.046015 -1.491302
N  -2.248745 -2.120208 -0.262383
C  -0.354268 -0.474154 -0.552914
C  -0.759971 -1.852309 0.050186
C  1.135261 -0.215124 -0.2757
C  -1.229338 0.698154 -0.081921
C  0.044191 -3.038496 -0.512753
C  2.092287 -0.363074 -1.310372
C  1.586403 0.164041 1.014979
C  -1.35756 1.821968 -0.937969
C  -1.874641 0.732845 1.180164
C  3.468626 -0.145184 -1.073941
C  2.957174 0.379758 1.273481
C  -2.10487 2.952761 -0.547546
C  -2.626275 1.863841 1.573779
C  3.88002 0.219933 0.221273
C  -2.742446 2.978736 0.714969
H  -0.484993 -0.573909 -1.64784
H  -0.713987 -1.844497 1.151487
H  1.107005 -2.923241 -0.245379
H  -0.043326 -3.081323 -1.612234
H  -0.318562 -3.991376 -0.090522
H  1.7649 -0.649068 -2.316931
H  0.864537 0.320274 1.824184
H  -0.867194 1.808487 -1.919291
H  -1.822244 -0.122446 1.862951
H  4.20093 -0.25587 -1.878749
H  3.299956 0.67463 2.26943
H  -2.194532 3.80849 -1.225818
H  -3.127266 1.86778 2.548169
H  -3.327858 3.852816 1.020548
