program: Gaussian 09
title: 000286310
version: EM64L-G09RevD.01
frameworkgroup: C1[X(C22H21NO7S2)]
method: RPBEPBE
basis: SDD
operation: Freq
keyword: #p
keyword: freq=noraman
keyword: PBEPBE/SDD
title: #p freq=noraman PBEPBE/SDD
converged: YES YES NO NO
title: Mulliken charges:
elementType: S S O O O O O O O N C C C C C C C C C C C C C C C C C C C C C C H H H H H H H H H H H H H H H H H H H H H
charge: 0.912342 0.981167 -0.318619 -0.526851 -0.540545 -0.405383 -0.501150 -0.491538 -0.216052 -0.210188 0.348879 -0.072667 -0.592232 -0.239980 -0.293266 -0.229068 -0.248731 0.231281 -0.346166 -0.329396 0.451782 -0.334288 -0.402279 0.216408 -0.153091 -0.797718 -0.240348 -0.206364 0.458548 -0.403745 -0.306885 -0.828046 0.317868 0.290788 0.245317 0.254123 0.271841 0.293453 0.282433 0.254131 0.244262 0.246183 0.237370 0.230068 0.241175 0.281064 0.287550 0.244510 0.275050 0.301929 0.234605 0.213416 0.387051
chargesum: 0.00000
title: Mulliken charges with hydrogens summed into heavy atoms:
elementType: S S O O O O O O O N C C C C C C C C C C C C C C C C C C C C C C
charge: 0.912342 0.981167 -0.318619 -0.526851 -0.540545 -0.018332 -0.501150 -0.491538 -0.216052 -0.210188 0.348879 -0.072667 0.016425 0.005336 -0.039142 0.042774 0.044722 0.231281 -0.063733 -0.075266 0.451782 -0.090026 -0.156096 0.216408 -0.153091 -0.089105 0.040716 0.081186 0.458548 -0.159235 -0.031835 -0.078095
polarizability: 6.31046217e+02 -3.93404120e+01 3.51410285e+02 -3.32687830e+01 -7.57934959e+00 2.70423283e+02
1716.lowfreq: -6.1225 -4.0228 -0.0006 0.0009 0.0014 1.0209 11.7679 17.4895 22.7311
frequency: 11.6406 17.3932 22.7170 31.8706 34.2729 35.6267 38.6777 51.3515 58.3699 62.9320 70.3810 78.9633 83.0510 86.0421 104.7176 114.5349 128.9991 132.7880 139.6542 142.6241 148.8809 150.7958 182.8713 198.6226 221.2634 226.8516 256.3122 270.3338 278.8772 293.2322 296.5875 304.9656 330.4284 371.6618 372.6708 376.3397 378.2900 390.1063 405.3415 405.8417 408.6674 410.7527 425.9090 437.4873 444.9371 485.8465 500.6726 504.5756 526.5239 548.5609 580.5782 581.4141 613.3125 617.3449 621.5334 633.1284 661.1782 701.0428 705.8222 729.2581 748.0721 770.8448 776.2646 781.3449 795.8024 806.4806 817.4680 819.5949 823.3017 837.4602 844.4425 845.4290 855.5991 891.4647 933.5424 960.1936 961.0239 961.8703 966.9644 971.1050 978.0370 978.7735 981.8544 985.9357 986.1629 995.5982 1000.0924 1021.8120 1042.2146 1049.4012 1049.8209 1054.6925 1056.0157 1110.6071 1117.9683 1122.6916 1154.4283 1183.8818 1187.7276 1201.8894 1218.7352 1220.8323 1254.6180 1269.1043 1290.4608 1295.3643 1298.4634 1308.2480 1336.7401 1356.0795 1379.0388 1379.9423 1390.8204 1396.0960 1401.5216 1402.4591 1420.0017 1463.9116 1464.4531 1465.6194 1468.3245 1469.7304 1471.6407 1475.0405 1480.1646 1491.0813 1579.1437 1581.6376 1585.6816 1591.6158 1594.8291 1668.9792 2966.1611 2983.6363 2999.3176 3047.0347 3053.9911 3063.1289 3086.9066 3093.9551 3135.4929 3136.7624 3137.4954 3145.4149 3151.8813 3155.9164 3159.1609 3162.7137 3166.8357 3169.9463 3174.1776 3176.6899 3512.7515
redmass: 5.8454 5.8485 7.3841 4.7630 6.3976 1.2234 3.0057 7.7669 5.9729 7.5377 8.2852 5.2032 5.8240 6.5980 8.8781 5.2582 4.9935 5.2657 2.6466 6.4527 8.3035 1.4889 12.6009 7.1022 7.2683 8.7715 3.3850 5.6633 5.6642 5.2592 5.5651 4.9460 4.5278 8.9887 4.7559 3.6019 5.2218 8.2472 3.1228 3.5050 2.9811 5.1414 5.4152 7.1082 2.9420 3.5565 3.0807 3.0805 4.2485 2.4438 5.8696 5.9272 6.5996 6.9361 6.9599 1.3951 6.1505 3.4191 3.3008 5.2247 4.3520 8.9330 4.9280 5.7506 1.3435 12.8607 3.8725 1.4506 1.3516 4.0932 1.2487 1.2618 1.9525 16.7441 14.8589 1.3012 1.3425 1.3867 2.3219 1.3743 2.0581 2.4485 1.4945 2.2489 1.9609 2.4971 1.4935 4.5079 2.4227 2.2946 1.6533 2.7086 1.6195 1.3699 1.2833 1.2850 1.4530 1.1396 1.1247 1.2121 2.9991 3.1142 2.7901 1.9152 1.4137 1.2687 1.2662 2.8753 3.0178 1.4264 4.6130 3.2045 3.1604 3.6902 1.2840 1.3724 1.1009 1.2379 1.8730 2.5963 3.9126 1.0491 2.3852 1.1050 1.1081 5.5229 6.0029 6.2416 5.8973 6.7628 6.0553 8.9593 1.0386 1.0377 1.0598 1.0956 1.0990 1.0973 1.0991 1.0991 1.0894 1.0889 1.0888 1.0878 1.0874 1.0893 1.0959 1.0961 1.0959 1.0966 1.0982 1.0966 1.0643
irintensity: 0.4942 1.0114 1.2101 0.3334 1.7341 0.9058 0.1418 1.8515 1.8764 5.7634 8.0569 10.4722 6.6748 0.7708 38.8547 3.9012 7.0277 3.6058 1.3288 50.1355 1.3178 0.3347 5.1855 10.1423 19.3853 8.7705 3.0424 5.7640 6.7250 1.1348 5.2849 1.9898 4.5629 4.2825 44.5172 5.4158 35.1778 107.4684 1.4245 29.8609 2.8646 70.8868 72.1699 30.8787 15.3361 58.2354 82.7541 68.1469 17.0412 16.1698 19.1124 25.5001 14.8937 0.7702 0.8504 96.3814 59.2227 3.1781 0.1083 1.9792 11.1140 65.6963 2.5597 38.8364 25.5313 182.0241 52.5847 19.9916 36.6964 10.7234 3.7233 5.2249 51.9403 47.5365 47.8674 1.1279 0.6311 3.1963 4.1695 2.9428 2.4491 4.2339 0.1518 5.8212 0.1754 18.7163 2.0942 216.5415 16.8810 25.7754 26.2233 189.4993 30.6899 8.5843 10.0546 7.5571 26.0256 35.1465 14.0683 3.5679 13.4187 4.1099 0.5509 22.1237 0.6427 2.5312 1.3968 22.5366 8.0234 16.0164 4.6621 11.4076 7.6517 12.9135 14.3885 26.8206 82.1482 9.8562 13.5823 9.2904 1.8449 14.2554 41.1694 16.1697 10.9668 1.5447 4.7275 0.3340 33.0318 2.1683 7.7731 154.5341 11.1899 27.8033 5.3266 12.6693 3.2045 13.8524 21.1505 14.4369 13.9103 11.1056 8.0401 8.9010 0.7117 0.2902 8.2071 4.5284 9.7544 3.8764 2.7886 2.7329 38.7028
temp: 298.150 k
press: 1.00000 atm
elementType: 16 16 8 8 8 8 8 8 8 7 6 6 6 6 6 6 6 6 6 6 6 6 6 6 6 6 6 6 6 6 6 6 1 1 1 1 1 1 1 1 1 1 1 1 1 1 1 1 1 1 1 1 1
symmnumber: 1
zpe: 1005001.0 jmol-1
zpe.correction: 0.382785 hartree
zpe.thermalcorrener: 0.416286 hartree
zpe.thermalcorrenthalpy: 0.417230 hartree
zpe.thermalcorrgfe: 0.312800 hartree
zpe.sumelectzpe: -2225.736952 hartree
zpe.sumelectthermal: -2225.703451 hartree
zpe.sumelectthermalent: -2225.702506 hartree
zpe.sumelectthermalfe: -2225.806937 hartree
dipole: -9.5877 -0.8485 0.0278
dipole: 9.6252
quadrupole: -222.2168 -171.9927 -207.6918
quadrupole: 18.2634 29.1020 -6.0139
quadrupole: -21.5831 28.6411 -7.0580 18.2634 29.1020 -6.0139
hfenergy: -2226.1197367 hartree
pointgroup: C01 [X(C22H21N1O7S2)]
dipole: 2.147441 3.0488159 -0.6582677 debye
polarizability: 496.0184657|147.0230517|487.8519581|4.0368114|-17.2783971|269.0093608 unknown
InChI: InChI=1S/C8H7NO3.2C7H7O2S/c10-7-3-1-6(2-4-7)9-5-8(11)12;2*1-6-2-4-7(5-3-6)10(8)9/h1-4,11H,5H2;2*2-5H,1H3
charge 0 multiplicity 1
53 atoms
S  1.58044 1.619286 0.718355
S  -3.711932 -3.539464 -0.253582
O  -2.63561 -2.896627 -2.070714
O  2.94074 1.754189 1.634415
O  0.083552 1.727174 1.387451
O  3.719504 -2.281223 2.010764
O  -2.830186 -4.750811 0.394813
O  -5.278171 -3.73258 -0.646859
O  1.597426 -1.336569 2.140537
N  2.025769 -0.179889 -0.566331
C  0.903744 -0.908587 -0.942559
C  1.659659 2.996799 -0.568189
C  3.090079 -0.839201 0.204286
C  0.781709 -2.33803 -0.787749
C  -0.172161 -0.200627 -1.587622
C  2.919688 3.41238 -1.029976
C  0.453833 3.572327 -0.998118
C  -1.480337 -2.276079 -1.756101
C  -0.362874 -3.006744 -1.21613
C  -1.34532 -0.854587 -1.949707
C  1.769599 5.067091 -2.456419
C  2.961081 4.454521 -1.979963
C  0.523565 4.61584 -1.949157
C  2.673055 -1.491439 1.530554
C  -3.472886 -2.000206 0.78351
C  1.838614 6.192001 -3.472318
C  -4.433874 -0.978239 0.695673
C  -2.285775 -1.891309 1.533766
C  -2.991727 0.381631 2.170923
C  -4.186245 0.209021 1.419566
C  -2.049985 -0.683578 2.218646
C  -2.69432 1.679033 2.890041
H  3.843294 -0.074024 0.473154
H  3.603278 -1.586664 -0.429029
H  1.604385 -2.919016 -0.359037
H  -0.06166 0.874836 -1.755843
H  3.8356 2.955275 -0.643515
H  -0.500811 3.236433 -0.579769
H  -0.458675 -4.092124 -1.110849
H  -2.188694 -0.313159 -2.390037
H  3.932209 4.799097 -2.354086
H  -0.403586 5.086083 -2.295489
H  2.412653 5.889312 -4.367259
H  0.834264 6.504565 -3.803435
H  2.344479 7.079497 -3.047779
H  -5.341597 -1.111843 0.098695
H  -1.571886 -2.71851 1.579934
H  -4.924932 1.017868 1.387283
H  -1.110576 -0.555294 2.765758
H  -1.719732 2.076592 2.546292
H  -2.607824 1.520584 3.98146
H  -3.475528 2.438292 2.716043
H  3.488882 -2.641408 2.910097
