program: Gaussian 09
title: 000286125
version: EM64L-G09RevD.01
frameworkgroup: C1[X(C12H18O2)]
method: RPBEPBE
basis: SDD
operation: Freq
keyword: #pfreq=noraman
keyword: PBEPBE/SDD
title: #p freq=noraman PBEPBE/SDD
converged: NO YES NO NO
title: Mulliken charges:
elementType: O O C C C C C C C C C C C C H H H H H H H H H H H H H H H H H H
charge: -0.431059 -0.221584 0.404162 0.309454 -0.102937 -0.102932 -0.596054 -0.495964 -0.495976 -0.517990 -0.517982 -0.449062 -0.784111 0.075898 0.202342 0.202343 0.223050 0.223074 0.198199 0.197187 0.197192 0.198201 0.205081 0.232899 0.232865 0.205094 0.198454 0.197141 0.212996 0.210145 0.212998 0.376876
chargesum: 0.00000
title: Mulliken charges with hydrogens summed into heavy atoms:
elementType: O O C C C C C C C C C C C C
charge: -0.054184 -0.221584 0.404162 0.309454 0.099405 0.099411 -0.149929 -0.100579 -0.100583 -0.080010 -0.080023 -0.053467 -0.147972 0.075898
polarizability: 1.35062344e+02 9.00408304e-01 1.25181425e+02 1.27220526e-03 2.47389740e-03 1.07962941e+02
1716.lowfreq: -29.0552 -25.6737 -0.0007 -0.0007 -0.0006 20.1604 35.6341 149.5576 156.0652
frequency: 35.2031 149.5125 155.9968 215.6819 237.8484 240.1460 305.1523 312.2530 330.8750 351.8181 390.7391 394.3467 404.4452 426.6633 455.4243 483.1169 539.2946 588.2004 603.0514 647.6607 685.5783 710.9310 739.9291 786.3191 822.0368 859.2398 869.0622 874.3847 877.9996 913.0875 917.4346 943.3115 966.3046 967.6624 990.8221 1012.7722 1020.9708 1042.3630 1055.6821 1062.6707 1077.5413 1107.7012 1109.8059 1114.0477 1154.1109 1169.5495 1172.9643 1229.3448 1260.9014 1269.5949 1282.7475 1284.6519 1289.4714 1291.4635 1292.6017 1315.3222 1319.3727 1331.1133 1341.2936 1345.7910 1350.1943 1355.6907 1384.3767 1448.2042 1449.4212 1460.1743 1462.4647 1464.1256 1473.4311 1473.6598 1485.0865 1643.4546 2955.9398 2958.6258 2963.6612 2968.2946 2976.6839 2978.0439 2982.8914 2995.2856 3004.6923 3013.3151 3017.7691 3030.0735 3039.6639 3049.1642 3052.7250 3058.7974 3059.8018 3512.0551
redmass: 10.1867 4.5358 3.6082 1.0244 2.1821 2.2716 5.2070 2.0858 3.8809 2.1572 3.7044 4.6124 2.0837 1.6899 1.7693 3.7072 2.7034 1.2324 3.9022 3.9812 4.4550 4.6698 3.4313 3.3204 2.6143 3.6882 1.5946 1.6229 1.6107 2.1673 1.8113 2.4378 2.0995 2.3014 3.3409 1.6435 1.8614 1.9204 1.8079 1.5781 1.8025 1.5712 1.0821 1.0624 2.5679 1.7096 1.0904 2.2944 1.6314 2.1344 2.0466 1.7525 1.4691 1.6777 1.8743 1.4314 1.8373 1.7245 1.4844 1.5089 1.5157 1.5504 1.2189 1.0818 1.0811 1.0878 1.0902 1.0906 1.0602 1.0580 1.0910 9.0138 1.0597 1.0539 1.0427 1.0627 1.0644 1.0618 1.0622 1.0820 1.0817 1.1027 1.1021 1.1026 1.1019 1.1014 1.1006 1.0988 1.0989 1.0640
irintensity: 0.5826 0.7166 0.0239 0.0012 0.0675 0.0978 6.1101 0.2480 1.3312 0.0640 0.0662 0.1448 0.1149 0.2173 5.3054 4.9965 1.0278 107.7224 40.0410 0.1549 1.4966 34.0181 4.4352 1.6385 0.0170 5.4709 0.0123 0.0104 0.8079 16.4307 1.1793 0.1837 8.8119 6.7432 88.2558 0.0299 0.9098 0.0192 50.6457 0.0587 105.8527 20.3964 1.9343 1.2265 4.5136 11.2738 0.0422 0.9939 0.3167 10.9825 23.6967 0.0507 0.0922 0.1429 3.4111 0.6484 1.5869 5.3776 2.9841 0.0263 6.4349 2.2754 10.9773 0.3473 0.5622 10.1682 17.9879 13.9476 18.1735 15.8210 0.6475 231.2602 28.6665 12.3096 72.3892 22.4320 5.3902 25.6425 63.9018 154.0419 49.3074 11.3772 32.0880 57.7347 13.2343 9.9519 52.1443 48.0787 53.3297 20.8536
temp: 298.150 k
press: 1.00000 atm
elementType: 8 8 6 6 6 6 6 6 6 6 6 6 6 6 1 1 1 1 1 1 1 1 1 1 1 1 1 1 1 1 1 1
symmnumber: 1
zpe: 730997.0 jmol-1
zpe.correction: 0.278422 hartree
zpe.thermalcorrener: 0.290405 hartree
zpe.thermalcorrenthalpy: 0.291349 hartree
zpe.thermalcorrgfe: 0.241229 hartree
zpe.sumelectzpe: -617.468624 hartree
zpe.sumelectthermal: -617.456641 hartree
zpe.sumelectthermalent: -617.455696 hartree
zpe.sumelectthermalfe: -617.505817 hartree
dipole: 0.9103 -1.7727 -0.0003
dipole: 1.9927
quadrupole: -81.6114 -90.7509 -83.0484
quadrupole: 4.5749 0.0022 -0.0024
quadrupole: 3.5255 -5.6140 2.0885 4.5749 0.0022 -0.0024
hfenergy: -617.7470458 hartree
pointgroup: C01 [X(C12H18O2)]
dipole: 0.3930042 0.6783921 -0.0002709 debye
polarizability: 134.9459077|-1.3955905|125.2978591|-0.0042539|-0.0055552|107.9629431 unknown
InChI: InChI=1S/C12H18O2/c1-11-3-8-2-9(4-11)6-12(5-8,7-11)10(13)14/h8-9,13H,2-7H2,1H3
charge 0 multiplicity 1
32 atoms
O  -3.218364 0.724039 0.000651
O  -2.868296 -1.562943 0.000733
C  1.479462 -0.959211 0.000458
C  -0.906802 -0.030952 0.000176
C  0.929818 1.192904 1.264602
C  0.929509 1.191236 -1.266364
C  -0.035593 -1.316038 0.000873
C  1.78609 -0.09991 1.263415
C  1.785792 -0.10157 -1.263674
C  -0.576675 0.822468 1.270633
C  -0.576995 0.820797 -1.271513
C  1.251549 2.031092 -0.001467
C  2.326007 -2.248107 0.001153
C  -2.381424 -0.409158 0.000527
H  1.154841 1.786937 2.172477
H  1.154279 1.784082 -2.175077
H  -0.279903 -1.930935 0.888826
H  -0.280141 -1.932029 -0.886251
H  2.864303 0.159817 1.283069
H  1.578028 -0.695018 2.176362
H  1.577526 -0.697868 -2.175796
H  2.863993 0.158155 -1.283913
H  -0.821217 0.241539 2.182171
H  -1.201502 1.73441 1.277737
H  -1.201824 1.732736 -1.279642
H  -0.821777 0.238641 -2.182203
H  0.654955 2.965192 -0.001994
H  2.320906 2.32181 -0.001791
H  2.113123 -2.865323 -0.892556
H  3.407781 -2.013279 0.000835
H  2.113404 -2.864226 0.895683
H  -4.166152 0.419313 0.000861
