program: Gaussian 09
title: 000024133
version: EM64L-G09RevD.01
frameworkgroup: C1[X(C15H18N2O4)]
method: RPBEPBE
basis: SDD
operation: Freq
keyword: #p
keyword: freq=noraman
keyword: PBEPBE/SDD
title: #p freq=noraman PBEPBE/SDD
converged: YES YES NO NO
title: Mulliken charges:
elementType: O O O O N N C C C C C C C C C C C C C C C H H H H H H H H H H H H H H H H H H
charge: -0.256652 -0.256659 -0.238397 -0.238816 0.021528 0.021666 0.340248 -0.441035 -0.441005 -0.540781 -0.541066 -0.247061 -0.248279 0.253662 0.254260 -0.331912 -0.332579 -0.046937 -0.046050 -0.546966 -0.546955 0.248179 0.248944 0.247346 0.249761 0.275265 0.276724 0.276454 0.275410 0.232246 0.240641 0.231644 0.241297 0.235727 0.235692 0.225553 0.221748 0.225535 0.221621
chargesum: 0.00000
title: Mulliken charges with hydrogens summed into heavy atoms:
elementType: O O O O N N C C C C C C C C C C C C C C C
charge: -0.256652 -0.256659 -0.238397 -0.238816 0.021528 0.021666 0.340248 0.056088 0.056102 0.011208 0.010798 -0.247061 -0.248279 0.253662 0.254260 0.140975 0.140362 0.188789 0.189642 -0.099666 -0.099799
polarizability: 2.59138372e+02 2.24015635e-01 1.48401610e+02 -1.55713029e+01 2.90545670e-01 1.45809285e+02
1716.lowfreq: -10.6617 -5.7675 -0.0009 0.0004 0.0011 2.0959 4.6644 9.1831 23.1656
frequency: -4.9669 8.9469 23.0965 23.9159 27.9848 32.3070 45.7299 57.5230 72.7590 84.6518 94.6526 107.2196 113.5911 120.2846 133.7509 164.8961 167.5155 175.0217 194.3274 213.9307 247.4491 263.7071 294.2712 320.9070 334.8177 363.9592 404.0445 464.3217 465.9444 492.6605 494.9377 551.9701 552.6367 565.4738 613.8541 629.2171 629.7919 636.3251 717.6362 725.2654 766.6699 776.8679 857.0910 860.0162 904.4066 905.5617 914.6653 929.8029 931.6020 962.6933 963.3691 979.3321 981.9621 990.8190 1010.7298 1011.4693 1018.9543 1069.7132 1095.1448 1097.5565 1104.4732 1133.8259 1141.5089 1153.2112 1154.2212 1164.8410 1213.2152 1213.7827 1227.4623 1272.1239 1279.8695 1283.7401 1284.2462 1295.6599 1318.3821 1334.0517 1337.4213 1362.2633 1379.6863 1432.6248 1432.6407 1444.3864 1446.9299 1456.1884 1466.0784 1466.5206 1467.0381 1633.5208 1634.8542 1664.6475 1665.1458 2191.7464 2193.8105 2998.4340 2998.8361 3002.2936 3002.4347 3021.0668 3024.0746 3048.8228 3049.5735 3073.3743 3073.4624 3087.9307 3092.8393 3094.6707 3094.8530 3123.5816 3124.0151 3205.8114 3206.1137
redmass: 4.1491 5.1012 6.3064 5.5417 5.7439 3.8349 3.1502 4.5795 3.8834 3.0318 3.8353 2.8805 5.2808 5.3435 3.6534 3.0519 5.5810 2.8457 3.2158 4.1022 4.0443 5.5864 4.7478 3.5243 5.3395 3.2654 2.5599 2.9499 4.0990 3.0137 6.2263 2.6581 2.6840 11.9775 7.6098 1.7727 1.6840 5.3228 4.8093 5.4071 1.4819 1.3605 4.3954 4.1590 3.4790 3.9438 2.2368 1.5776 1.6630 1.3446 1.3412 2.0817 1.8433 3.6438 1.3439 1.3928 1.8538 6.0109 3.8635 3.7651 1.8975 3.0169 2.9803 1.7662 1.8845 1.1418 1.2308 1.2270 1.5347 1.3785 1.1081 1.2413 1.2488 1.4539 1.2086 1.3145 1.3474 1.7268 1.6188 1.1933 1.1934 1.0826 1.0885 1.0902 1.0898 1.0933 1.0965 9.6062 9.6374 4.7842 4.7789 12.6564 12.6383 1.0608 1.0609 1.0585 1.0584 1.0601 1.0598 1.0995 1.0996 1.1049 1.1049 1.1047 1.1037 1.0610 1.0609 1.0951 1.0951 1.1145 1.1145
irintensity: 0.3434 0.5420 0.9658 2.3650 0.3491 0.8278 0.0246 0.2970 0.0809 4.2668 0.0362 5.4781 1.5979 4.0955 1.8865 14.9567 1.7928 0.3401 0.0437 11.7193 1.0742 0.5427 4.3884 0.0716 49.6687 2.5476 0.4800 0.9579 2.0162 0.0053 0.0004 0.0276 2.6881 0.2910 9.8267 10.2138 9.7407 4.0124 0.4362 8.6943 14.6784 0.0250 24.2655 40.2583 0.3326 12.8938 11.2992 100.8600 5.8241 65.8410 85.3576 9.5713 0.1573 192.1813 13.6038 4.7561 0.2203 4.3977 1.2283 16.5609 2.9298 699.1278 12.0415 77.0806 9.6212 0.9619 1.5882 1.5307 10.2327 165.5316 0.1337 0.4619 5.3520 1.5952 2.0431 8.5741 3.7253 121.7267 6.7542 23.2982 3.7708 0.3925 44.8909 0.1189 3.6636 21.6493 25.1527 51.2690 309.2427 5.7321 5.5489 1.1071 1.3383 10.1784 0.2899 13.4977 16.0966 6.4280 10.4659 0.0163 1.4915 10.8803 12.8858 0.0095 17.7394 9.3456 9.1516 8.8339 8.8573 22.1405 21.9644
temp: 298.150 k
press: 1.00000 atm
elementType: 8 8 8 8 7 7 6 6 6 6 6 6 6 6 6 6 6 6 6 6 6 1 1 1 1 1 1 1 1 1 1 1 1 1 1 1 1 1 1
symmnumber: 1
zpe: 790923.2 jmol-1
zpe.correction: 0.301247 hartree
zpe.thermalcorrener: 0.324637 hartree
zpe.thermalcorrenthalpy: 0.325581 hartree
zpe.thermalcorrgfe: 0.242432 hartree
zpe.sumelectzpe: -991.137286 hartree
zpe.sumelectthermal: -991.113896 hartree
zpe.sumelectthermalent: -991.112952 hartree
zpe.sumelectthermalfe: -991.196101 hartree
dipole: 0.0027 1.3153 -0.1213
dipole: 1.3209
quadrupole: -79.0859 -143.7817 -131.0972
quadrupole: -0.0344 -0.1560 -0.1091
quadrupole: 38.9023 -25.7934 -13.1089 -0.0344 -0.1560 -0.1091
hfenergy: -991.4385331 hartree
pointgroup: C01 [X(C15H18N2O4)]
dipole: -0.0000089 -0.5133055 -0.0811257 debye
polarizability: 258.8502997|-0.7135698|148.4273389|16.570492|-0.11728|146.0716286 unknown
InChI: InChI=1S/C15H18N2O4/c1-3-9-20-13(18)5-7-15(11-16,12-17)8-6-14(19)21-10-4-2/h3-4H,1-2,5-10H2
charge 0 multiplicity 1
39 atoms
O  -4.990917 0.000213 -0.017079
O  4.983092 0.0071 0.024653
O  -3.753525 -1.971324 -0.177809
O  3.749573 -1.971601 -0.072075
N  0.012759 2.060178 -2.00047
N  -0.024739 1.637055 2.391039
C  -0.004237 0.334159 0.049475
C  -1.285508 -0.571047 -0.046932
C  1.279238 -0.569811 -0.027087
C  -2.607257 0.213948 0.013632
C  2.599222 0.215735 0.059538
C  0.004552 1.311862 -1.072249
C  -0.015175 1.079937 1.336928
C  -3.803058 -0.72338 -0.071929
C  3.796914 -0.720898 -0.004945
C  -6.259217 -0.808644 -0.084789
C  6.254455 -0.798058 -0.028946
C  -7.385765 0.099185 0.317636
C  7.367959 0.151967 -0.364601
C  -8.497008 0.297121 -0.432991
C  8.497938 0.276779 0.373718
H  -1.226979 -1.14237 -0.990404
H  -1.243469 -1.306027 0.776448
H  1.236991 -1.137757 -0.973548
H  1.224137 -1.307845 0.792734
H  -2.69031 0.796727 0.950785
H  -2.682093 0.947906 -0.811104
H  2.664652 0.793864 1.001213
H  2.689089 0.953822 -0.75971
H  -6.373809 -1.193142 -1.113455
H  -6.140773 -1.669101 0.601046
H  6.398187 -1.286579 0.950821
H  6.118312 -1.582978 -0.797137
H  -7.278653 0.589614 1.294372
H  7.23431 0.739622 -1.2826
H  -9.316414 0.934517 -0.084434
H  -8.621469 -0.174889 -1.415495
H  9.306963 0.950261 0.071993
H  8.648332 -0.293819 1.298559
