program: Gaussian 09
title: 000286130
version: EM64L-G09RevD.01
frameworkgroup: C1[X(C13H19ClO)]
method: RPBEPBE
basis: SDD
operation: Freq
keyword: #p
keyword: freq=noraman
keyword: PBEPBE/SDD
title: #p freq=noraman PBEPBE/SDD
converged: NO YES NO NO
title: Mulliken charges:
elementType: Cl O C C C C C C C C C C C C C H H H H H H H H H H H H H H H H H H H
charge: -0.123272 -0.081592 0.382296 -0.137791 -0.092481 -0.078458 -0.572798 -0.477065 -0.439876 -0.493587 -0.425228 -0.500370 -0.498535 -0.435684 -0.169043 0.231233 0.201140 0.196503 0.241121 0.228714 0.222746 0.251918 0.202355 0.223356 0.217339 0.207924 0.205724 0.225911 0.238119 0.210058 0.210421 0.209094 0.202063 0.217741
chargesum: 0.00000
title: Mulliken charges with hydrogens summed into heavy atoms:
elementType: Cl O C C C C C C C C C C C C C
charge: -0.123272 -0.081592 0.382296 0.093442 0.108659 0.118045 -0.102963 -0.002400 -0.014164 -0.068323 0.006408 -0.052192 -0.079020 -0.015879 -0.169043
polarizability: 1.50582921e+02 -3.25766913e+00 1.39667520e+02 1.52515127e+00 -5.40746295e+00 1.25500720e+02
1716.lowfreq: -7.6760 0.0005 0.0008 0.0013 13.5701 15.6794 45.4459 111.8046 138.3805
frequency: 45.2099 111.7655 138.3755 189.1038 218.9362 239.9663 276.8876 289.9983 319.9606 336.9269 341.8409 366.7980 377.4881 393.3801 397.6817 450.8923 481.4099 522.7561 578.5054 613.4333 664.9787 679.3063 696.5473 720.8162 768.7588 786.8910 807.1119 825.1255 851.0255 859.2029 883.4499 894.1155 917.0207 938.9527 947.4585 957.2204 976.8435 1034.3159 1056.4625 1063.2575 1072.2918 1088.2478 1093.4654 1104.3904 1124.8672 1145.2479 1160.9953 1185.0943 1206.1123 1219.1468 1239.5563 1241.0163 1245.7760 1270.3445 1274.1081 1280.4476 1298.6478 1306.9152 1315.2725 1324.6020 1325.5721 1330.8509 1337.1250 1343.1934 1351.8951 1355.4338 1367.5385 1384.7998 1467.3458 1471.6747 1473.5340 1483.0722 1487.4848 1494.5083 1505.7534 1518.9552 1729.8044 2956.7699 2970.1795 2974.8981 2977.5281 2981.5448 2987.1790 2994.0446 2999.0178 3001.6641 3006.0989 3014.7733 3025.9880 3033.5536 3041.5478 3048.1652 3059.8253 3064.6876 3073.6915 3093.1569
redmass: 11.5056 4.8508 5.3397 3.4852 3.3033 2.7978 2.1305 3.0562 3.1428 1.7930 3.1651 3.4578 2.3499 2.8279 2.9394 5.5020 4.6536 4.3663 3.1481 6.6512 3.6049 4.5753 4.5639 2.2079 1.5493 1.7024 1.5461 2.4819 1.8722 2.5133 2.3776 3.0207 2.4534 1.7701 2.4602 2.0594 2.4668 4.5043 2.0148 2.1640 2.0846 2.2714 1.7191 2.1681 2.4547 2.1342 1.3676 1.2380 1.3609 1.2187 1.2610 1.3850 1.1776 1.1724 1.2387 1.2888 1.3661 1.6031 1.4950 1.4063 1.3287 1.3405 1.4040 1.3425 1.3534 1.3181 1.3025 1.2509 1.0769 1.0837 1.0751 1.0851 1.0743 1.0725 1.0799 1.0827 12.9956 1.0799 1.0734 1.0709 1.0672 1.0686 1.0703 1.0693 1.0710 1.0685 1.0698 1.0743 1.0987 1.0986 1.0941 1.0961 1.0966 1.0977 1.0964 1.0932
irintensity: 0.0486 0.9779 1.4802 0.5058 2.9600 0.2356 2.5712 10.8439 0.6469 0.1492 1.7377 0.5647 1.7741 6.5462 5.6095 1.2519 0.6595 13.4947 0.0712 1.5160 12.1601 20.5484 76.5771 20.0770 30.5723 13.4701 0.9565 1.3594 20.5433 4.7341 4.6989 10.2293 16.9890 1.1031 0.4118 7.6159 0.8914 36.5439 1.0589 0.6673 2.6751 7.1919 0.8972 0.4224 0.4837 3.7438 1.9707 0.3344 4.6437 0.7146 6.7070 2.1548 2.7349 3.1889 0.5897 0.1053 0.6499 0.9493 3.8070 0.3188 0.3324 1.3061 0.4893 2.2805 3.6803 0.0460 0.6270 0.0232 0.4089 0.4246 2.5438 26.2816 22.0150 14.4981 41.7813 0.4524 262.5103 0.4267 1.7737 6.0800 10.3316 13.7729 19.3749 74.0254 108.9871 60.1932 138.6030 38.6565 17.7944 29.0264 8.7317 3.9789 30.7473 61.8459 51.6779 18.6692
temp: 298.150 k
press: 1.00000 atm
elementType: 17 8 6 6 6 6 6 6 6 6 6 6 6 6 6 1 1 1 1 1 1 1 1 1 1 1 1 1 1 1 1 1 1 1
symmnumber: 1
zpe: 777271.1 jmol-1
zpe.correction: 0.296047 hartree
zpe.thermalcorrener: 0.308871 hartree
zpe.thermalcorrenthalpy: 0.309815 hartree
zpe.thermalcorrgfe: 0.257681 hartree
zpe.sumelectzpe: -1040.880271 hartree
zpe.sumelectthermal: -1040.867447 hartree
zpe.sumelectthermalent: -1040.866503 hartree
zpe.sumelectthermalfe: -1040.918637 hartree
dipole: -4.3971 0.1117 0.4823
dipole: 4.4249
quadrupole: -110.6919 -96.8331 -96.4661
quadrupole: -0.7152 1.9713 3.0147
quadrupole: -9.3615 4.4973 4.8642 -0.7152 1.9713 3.0147
hfenergy: -1041.1763178 hartree
pointgroup: C01 [X(C13H19Cl1O1)]
dipole: 1.6965349 0.3880519 0.0436402 debye
polarizability: 148.611805|3.9920104|138.2329031|3.3958825|8.7007831|128.9064537 unknown
InChI: InChI=1S/C13H19ClO/c14-12(15)13-7-5-10(6-8-13)9-1-3-11(13)4-2-9/h9-11H,1-8H2
charge 0 multiplicity 1
34 atoms
Cl -3.008289 -1.481802 -1.08084
O  -3.259645 0.457709 0.831968
C  -0.912561 0.211409 0.003603
C  -0.201332 -1.118183 0.586302
C  1.645489 1.309161 -0.439154
C  2.311116 -0.11328 -0.182298
C  -0.629505 1.50334 0.832101
C  -0.600078 0.55019 -1.498334
C  0.862384 1.947743 0.748984
C  0.711788 1.378398 -1.673789
C  0.799148 -0.89741 1.765179
C  0.516784 -1.983612 -0.480113
C  2.255796 -0.584356 1.294985
C  1.794408 -1.297713 -1.057409
C  -2.412939 -0.058281 0.116645
H  -1.020833 -1.740797 0.997664
H  2.493752 1.993904 -0.641023
H  3.380943 0.014114 -0.44429
H  -0.950105 1.373039 1.880284
H  -1.277458 2.30016 0.419137
H  -1.447849 1.137267 -1.901994
H  -0.576012 -0.378243 -2.087869
H  0.884363 3.046092 0.607508
H  1.38314 1.759796 1.702619
H  1.236198 1.054758 -2.591677
H  0.452016 2.444244 -1.830654
H  0.808499 -1.837196 2.351463
H  0.427688 -0.123458 2.457864
H  -0.181147 -2.277608 -1.283447
H  0.803898 -2.924896 0.0298
H  2.730485 0.154191 1.967579
H  2.871296 -1.502927 1.370175
H  2.606346 -2.049696 -1.109418
H  1.631316 -0.96666 -2.097848
