program: Gaussian 09
title: 000286111
version: EM64L-G09RevD.01
frameworkgroup: C1[X(C7H4Br6)]
method: RPBEPBE
basis: SDD
operation: Freq
keyword: #pfreq=noraman
keyword: PBEPBE/SDD
title: #p freq=noraman PBEPBE/SDD
converged: YES YES NO YES
title: Mulliken charges:
elementType: Br Br Br Br Br Br C C C C C C C H H H H
charge: 0.119500 0.119500 0.152316 0.180194 0.128822 0.128823 -0.257606 -0.257606 -0.523590 -0.402167 -0.402168 -0.054195 -0.054196 0.296298 0.264888 0.264888 0.296298
chargesum: 0.00000
title: Mulliken charges with hydrogens summed into heavy atoms:
elementType: Br Br Br Br Br Br C C C C C C C
charge: 0.119500 0.119500 0.152316 0.180194 0.128822 0.128823 -0.257606 -0.257606 -0.523590 0.159019 0.159018 -0.054195 -0.054196
polarizability: 1.85152335e+02 -3.27205877e-04 1.98451813e+02 1.05603691e+01 2.08796360e-04 1.28034053e+02
1716.lowfreq: -0.0003 -0.0001 -0.0001 1.6818 4.1681 5.0459 48.3115 52.3283 79.8596
frequency: 48.3113 52.3280 79.8587 95.1565 97.1516 105.2365 111.4875 112.4045 162.0243 196.4299 207.0361 213.0601 218.3249 280.3457 308.9722 312.2449 452.5745 456.8504 527.7620 530.6064 597.2408 708.6871 754.4453 771.3825 818.1377 840.7866 938.9355 947.2908 975.0763 992.2673 1010.2376 1051.3651 1055.8704 1115.9058 1182.4388 1208.7842 1253.9107 1276.2681 1458.2967 1471.3664 1558.6994 3044.7571 3052.6188 3111.0496 3126.9821
redmass: 63.8968 44.1135 69.3119 51.8244 65.3943 71.9929 22.5788 46.0554 44.1226 10.4983 39.9115 10.7160 72.2384 1.8646 7.1933 4.5499 9.4035 10.1078 7.8924 4.4789 7.3028 7.1899 4.7784 5.5901 10.4116 1.4634 3.5854 5.8221 5.0735 9.3485 3.9089 3.7987 3.7633 3.9917 1.4322 1.2112 1.3629 1.3727 1.0754 1.0865 11.8658 1.0584 1.0614 1.1069 1.1066
irintensity: 0.0002 0.0272 0.0012 0.0086 0.0003 0.0293 0.0887 0.1703 0.1947 1.4414 0.0417 0.6686 0.1847 0.2250 3.0996 4.1797 6.7470 33.4147 3.6487 22.9114 2.8985 40.0570 114.6405 0.1083 3.2388 26.9966 1.8057 76.6054 39.6454 11.2549 3.9021 20.3630 0.7723 53.2045 1.0105 17.0043 10.8676 18.4005 5.7338 16.2842 76.4003 6.4910 13.8204 0.0054 8.3811
temp: 298.150 k
press: 1.00000 atm
elementType: 35 35 35 35 35 35 6 6 6 6 6 6 6 1 1 1 1
symmnumber: 1
zpe: 232619.6 jmol-1
zpe.correction: 0.088600 hartree
zpe.thermalcorrener: 0.103461 hartree
zpe.thermalcorrenthalpy: 0.104405 hartree
zpe.thermalcorrgfe: 0.042177 hartree
zpe.sumelectzpe: -348.889160 hartree
zpe.sumelectthermal: -348.874299 hartree
zpe.sumelectthermalent: -348.873355 hartree
zpe.sumelectthermalfe: -348.935583 hartree
dipole: 0.7966 0.0000 -2.7862
dipole: 2.8978
quadrupole: -129.9824 -131.7655 -124.8788
quadrupole: 0.0000 1.8862 0.0000
quadrupole: -1.1068 -2.8900 3.9968 0.0000 1.8862 0.0000
hfenergy: -348.9777598 hartree
pointgroup: C01 [X(C7H4Br6)]
dipole: 0.2578563 -0.0000135 1.110556 debye
dipolederiv: -0.0483978 0.1417663 -0.0214425 0.1237517 -0.52735 0.0798765 -0.0250974 0.1018139 -0.049242 -0.0483401 -0.1416602 -0.0214359 -0.1236452 -0.5273943 -0.0799178 -0.0250846 -0.1018557 -0.0492562 -0.7637693 -0.0000901 0.1633483 -0.0000913 -0.0007051 0.0000237 0.1894595 0.0000264 -0.1454106 -0.0763365 -0.0000138 0.1349655 -0.0000105 0.0019032 0.0000369 0.0497056 0.0000277 -0.5781181 -0.3982812 -0.3810021 0.028673 -0.2953383 -0.2073898 0.0079301 0.0294908 0.0131201 0.0684398 -0.3984289 0.3809579 0.0287036 0.2952941 -0.2072396 -0.0079447 0.0295156 -0.0131337 0.0684383 -0.011071 -0.313407 0.0765115 -0.2516476 0.8396037 -0.0041641 0.1469944 -0.2837234 0.0004033 -0.0111932 0.3132155 0.076535 0.25145 0.8397045 0.0042451 0.1469517 0.28382 0.0004264 1.0649963 0.0001557 -0.3317595 0.0001531 -0.2381493 -0.0000819 -0.2466158 -0.0000728 0.9559722 -0.0194253 0.0816314 -0.0279925 0.0861086 -0.1844878 0.0675086 0.0026088 -0.0936558 -0.0377714 -0.0193892 -0.0815934 -0.0279836 -0.0860726 -0.1845272 -0.0675268 0.0025819 0.0936449 -0.0377708 0.3781715 0.6315191 -0.0178529 0.6732739 0.1436794 0.0029119 -0.1479546 0.0615293 -0.1866604 0.378457 -0.6314665 -0.0179 -0.673211 0.1433967 -0.0028908 -0.1479915 -0.0615377 -0.1866663 -0.029016 0.067416 0.0685501 0.0159094 0.0465319 -0.0162507 0.0684692 -0.0366067 0.0750976 0.0155213 -0.0589383 -0.0897281 -0.0390527 0.0079486 -0.0420084 -0.0707467 -0.0111286 0.0135058 0.0154999 0.0589471 -0.0897331 0.03906 0.0079658 0.0419889 -0.0707464 0.0111129 0.0135101 -0.0289975 -0.0674376 0.0685411 -0.0159316 0.0465092 0.0162637 0.0684596 0.0366193 0.0751024 unknown
polarizability: 186.06893|-0.0010143|198.4518133|-7.6372065|0.0018605|127.1174582 unknown
InChI: InChI=1S/C7H4Br6/c8-3-4(9)6(11)2-1-5(3,10)7(6,12)13/h1-2H2
charge 0 multiplicity 1
17 atoms
Br -0.701786 3.00552 -0.209056
Br -0.70113 -3.005671 -0.209285
Br -3.008192 -0.000335 -0.056149
Br -0.851569 -0.000005 -2.468112
Br 2.702749 1.853199 -0.229375
Br 2.703155 -1.852603 -0.229516
C  -0.23266 1.140695 0.260106
C  -0.23241 -1.140779 0.260019
C  -1.042966 -0.000102 -0.475824
C  -0.475969 0.786801 1.773784
C  -0.475797 -0.787055 1.773723
C  1.203002 0.682987 -0.064088
C  1.203152 -0.682732 -0.064141
H  -1.445377 1.188982 2.105921
H  0.325023 1.221251 2.391981
H  0.32529 -1.221378 2.391887
H  -1.445116 -1.189476 2.105828
