program: Gaussian 09
title: 000286112
version: EM64L-G09RevD.01
frameworkgroup: C1[X(C9H8Cl4O2)]
method: RPBEPBE
basis: SDD
operation: Freq
keyword: #p
keyword: freq=noraman
keyword: PBEPBE/SDD
title: #p freq=noraman PBEPBE/SDD
converged: YES YES NO NO
title: Mulliken charges:
elementType: Cl Cl Cl Cl O O C C C C C C C C C H H H H H H H H
charge: 0.012997 0.013210 0.045891 0.045824 -0.244669 -0.232111 -0.226017 -0.224849 -0.010950 -0.402196 -0.401965 -0.013514 -0.014037 0.305762 -0.762385 0.305224 0.267030 0.250766 0.250871 0.266869 0.263313 0.252396 0.252541
chargesum: 0.00000
title: Mulliken charges with hydrogens summed into heavy atoms:
elementType: Cl Cl Cl Cl O O C C C C C C C C C
charge: 0.012997 0.013210 0.045891 0.045824 -0.244669 -0.232111 -0.226017 -0.224849 0.294274 0.115600 0.115775 -0.013514 -0.014037 0.305762 0.005865
polarizability: 1.36758864e+02 6.52435630e-01 1.53170036e+02 6.16985064e+00 -6.79390688e-02 1.13682436e+02
1716.lowfreq: -57.5430 -6.8237 -3.1305 -0.0006 0.0018 0.0030 9.7210 18.9617 58.3230
frequency: -57.5385 18.6035 58.3226 64.3479 80.4817 134.5048 142.1087 153.4131 154.0847 180.3084 214.8879 240.1711 247.5978 304.7213 307.8238 351.5298 375.6243 452.5001 498.1741 512.2874 528.8391 563.6277 564.4092 619.1634 622.6466 713.0725 816.8499 822.9268 834.6630 890.1977 940.1863 967.8945 969.6577 1006.2119 1010.7498 1020.3617 1047.6096 1068.4757 1070.3098 1095.5832 1139.1048 1175.2916 1187.8548 1211.3173 1251.1507 1256.2590 1275.5703 1355.2167 1387.8151 1453.9652 1457.6688 1463.6164 1477.3499 1601.2714 1668.7389 3010.7707 3034.0092 3044.0422 3059.5984 3098.0043 3101.8982 3120.4553 3145.5338
redmass: 1.0535 13.4953 8.7167 3.5582 22.7148 9.3644 13.8497 27.2161 13.1427 7.4140 4.2873 2.4003 11.6981 4.5276 11.8744 10.8424 6.3250 5.2802 5.8054 5.5786 5.1555 4.8327 3.7858 5.4692 8.5700 5.8769 1.9646 2.4862 4.2885 7.7115 3.5459 3.4033 4.3549 2.1806 3.2215 6.9506 1.6191 2.3712 3.1365 4.0344 3.4032 3.2454 1.2217 2.0490 1.4688 1.5825 1.4914 1.2732 1.2250 1.0667 1.0456 1.0793 1.0930 11.9072 10.7894 1.0368 1.0592 1.0624 1.0868 1.0971 1.1065 1.1063 1.1011
irintensity: 1.4062 0.5158 0.8461 3.9017 0.0773 3.4297 0.1643 0.0165 0.9359 5.6121 0.3034 0.8245 0.4076 0.6097 0.0317 1.2706 3.5449 9.5124 12.8714 23.6705 3.2493 0.5423 1.6406 11.8742 28.2967 43.9436 66.7809 14.3122 0.1366 9.9641 2.3662 8.4045 66.7128 75.2426 1.1779 9.7361 10.1881 114.2066 9.1047 74.9498 11.2749 357.1261 0.8929 6.9584 17.5045 19.8202 49.2025 5.3211 58.6018 12.6368 15.1792 4.0131 11.3348 65.1594 188.9880 1.1461 9.6795 17.0787 20.8540 3.4331 0.1493 13.4707 5.7509
temp: 298.150 k
press: 1.00000 atm
elementType: 17 17 17 17 8 8 6 6 6 6 6 6 6 6 6 1 1 1 1 1 1 1 1
symmnumber: 1
zpe: 398604.3 jmol-1
zpe.correction: 0.151820 hartree
zpe.thermalcorrener: 0.166640 hartree
zpe.thermalcorrenthalpy: 0.167584 hartree
zpe.thermalcorrgfe: 0.107604 hartree
zpe.sumelectzpe: -2337.289778 hartree
zpe.sumelectthermal: -2337.274959 hartree
zpe.sumelectthermalent: -2337.274015 hartree
zpe.sumelectthermalfe: -2337.333995 hartree
dipole: -0.6632 0.0028 0.9884
dipole: 1.1903
quadrupole: -116.5265 -121.1396 -105.1943
quadrupole: -0.1687 -11.9729 0.1143
quadrupole: -2.2397 -6.8528 9.0925 -0.1687 -11.9729 0.1143
hfenergy: -2337.4415988 hartree
pointgroup: C01 [X(C9H8Cl4O2)]
dipole: 0.316788 0.0345454 0.3431542 debye
dipolederiv: -0.3680832 0.2677336 0.0785931 0.2478594 -0.4324874 -0.099165 0.0656069 -0.0776826 -0.1770272 -0.1422316 -0.0134819 -0.0138708 0.0066985 -0.6592622 -0.1029827 -0.0006719 -0.1246795 -0.1751544 -0.0498349 -0.222734 0.1085755 -0.1361476 -0.5811602 0.1929345 0.1096789 0.2379635 -0.1132373 -0.3571571 0.1823582 0.3573636 0.0981395 -0.0834562 -0.0711201 0.3497009 -0.1180169 -0.3038468 -1.6477299 -0.4889266 -0.2135724 -0.4535517 -0.398035 -0.0158424 -0.3751697 -0.0768013 -0.4789118 -0.7870951 -0.1827936 -0.0302378 -0.2811466 -0.4269488 0.1114051 0.3332655 0.2506954 -0.755979 0.490343 -0.4320622 -0.1879588 -0.4397699 0.4646891 0.2069754 -0.0987817 0.0872926 0.2647666 0.0507745 0.0668026 0.0502387 0.0545694 0.9497362 0.0338508 0.0386943 0.1812848 0.2118211 0.6040874 0.2039065 0.1378156 0.0810371 -0.0032781 -0.0206672 0.6107981 0.1605024 0.2459643 -0.0607207 0.0700653 0.0211337 0.1004604 -0.0450032 -0.0138732 0.0308323 -0.095831 -0.0365293 0.0228384 0.0034344 -0.0003193 -0.01382 -0.1633465 -0.0327129 -0.0565104 0.03162 -0.001219 -0.1531737 0.3694831 -0.04567 0.303657 0.7089075 -0.3153394 -0.1685689 -0.284297 0.0201743 0.4163876 -0.3252129 -0.4830207 -0.2190365 -0.1321052 0.1684664 -0.5184436 0.0777077 0.2904075 1.9619724 0.6200237 0.2363897 0.7406205 0.5089918 -0.1227368 -0.1933661 -0.2875669 1.002587 -0.2563959 -0.0445396 -0.2401201 -0.0566125 0.0067 -0.0272234 -0.1979855 -0.0094495 -0.2347051 0.0850101 -0.0134837 0.0592415 0.0220505 0.0801327 0.0459247 -0.0761683 -0.0063845 -0.0071194 0.0499486 0.0099941 0.0765789 -0.0095739 0.064004 0.0175402 0.08182 -0.0225342 -0.0742105 -0.026035 -0.0651301 -0.035567 -0.0684527 -0.0273007 -0.0471014 -0.0243009 0.0010508 0.0868382 -0.0989676 0.0216241 -0.0206204 0.0124488 0.0509712 -0.0088373 0.0179471 -0.0386909 0.0812737 0.0709769 -0.025775 0.04079 -0.0042679 -0.0090828 0.071417 0.0275831 0.1086845 -0.0220191 0.0693227 -0.0433646 0.0915089 -0.0327196 0.0869982 0.063518 0.0526828 0.0479735 0.0139222 0.0027224 0.0707953 0.0186532 0.1006358 0.0830538 0.0019483 0.0283667 -0.0361797 0.0778586 0.1230408 -0.0287169 -0.0059249 -0.0530779 -0.0427182 -0.0363786 -0.0370095 -0.0066613 0.0843452 unknown
polarizability: 135.2194115|-3.56979|150.7215757|-11.0188857|4.9409326|117.6703482 unknown
InChI: InChI=1S/C9H8Cl4O2/c1-4(14)15-7-8(12)2-3-9(7,13)6(11)5(8)10/h7H,2-3H2,1H3
charge 0 multiplicity 1
23 atoms
Cl -0.924376 2.575383 1.122137
Cl 1.00941 -2.627646 -0.205922
Cl 1.663201 2.926842 -1.11428
Cl 2.86902 -0.312063 -1.940058
O  -1.237987 -0.230401 -0.603611
O  -2.917918 -1.23047 0.690054
C  0.275736 1.206375 0.804517
C  1.038646 -0.845029 0.280743
C  -0.356628 -0.19764 0.547752
C  1.208315 0.873846 2.02341
C  1.742974 -0.565827 1.656558
C  1.161612 1.363984 -0.434739
C  1.623175 0.123908 -0.750956
C  -2.5299 -0.787501 -0.408701
C  -3.309302 -0.750806 -1.699647
H  -0.867507 -0.615329 1.433574
H  0.618087 0.864122 2.954849
H  2.01029 1.621559 2.122028
H  2.838353 -0.608992 1.5553
H  1.426874 -1.318205 2.398233
H  -2.718588 -0.302559 -2.510257
H  -4.237231 -0.172579 -1.548638
H  -3.604457 -1.777968 -1.97565
