program: Gaussian 09
title: 000286101
version: EM64L-G09RevD.01
frameworkgroup: C1[X(C8H14N6)]
method: RPBEPBE
basis: SDD
operation: Freq
keyword: #pfreq=noraman
keyword: PBEPBE/SDD
title: #p freq=noraman PBEPBE/SDD
converged: YES YES NO NO
title: Mulliken charges:
elementType: N N N N N N C C C C C C C C H H H H H H H H H H H H H H
charge: -0.402802 -0.142626 -0.711927 -0.119456 -0.142310 -0.639677 -0.052936 -0.446371 -0.494910 -0.425879 -0.463513 0.200051 0.065792 0.172856 0.271097 0.211069 0.255924 0.229072 0.214534 0.220017 0.219062 0.227826 0.205610 0.295463 0.309960 0.310178 0.334854 0.299046
chargesum: 0.00000
title: Mulliken charges with hydrogens summed into heavy atoms:
elementType: N N N N N N C C C C C C C C
charge: -0.107340 -0.142626 -0.091788 -0.119456 -0.142310 -0.005778 0.218161 0.020622 -0.051305 0.013201 -0.030078 0.200051 0.065792 0.172856
polarizability: 1.82758305e+02 8.87812805e-01 1.31048119e+02 1.06113007e+01 1.48765997e+00 8.40373347e+01
1716.lowfreq: -4.8766 -0.0008 -0.0008 0.0005 9.4341 16.3377 41.7699 53.7705 75.1637
frequency: 41.4053 53.5657 75.0103 90.0954 115.3528 170.4238 179.0112 207.5272 219.1588 257.4784 289.4103 325.3580 345.6028 413.3809 432.6418 487.6989 527.8841 530.9306 548.5586 562.7201 578.4499 628.5598 631.0592 685.7738 727.2489 748.9040 790.5186 809.3961 864.5187 880.4963 885.1220 898.3107 918.3185 945.8711 984.8026 1019.1521 1027.4725 1050.0507 1061.9374 1080.8766 1100.3651 1151.9657 1160.4565 1187.1884 1209.0849 1219.5168 1241.6376 1257.7478 1285.1041 1290.9081 1309.9474 1312.4730 1323.2257 1341.7879 1424.2681 1438.5915 1463.5265 1475.0827 1479.6725 1496.4364 1563.1465 1571.7813 1607.7054 1616.0148 2984.2330 3004.4372 3005.8339 3013.8188 3044.7167 3064.8810 3068.4334 3076.8724 3093.8790 3521.0676 3529.7869 3535.5432 3669.4607 3678.4943
redmass: 3.8295 3.5552 1.9158 3.8214 3.4141 2.8641 1.7684 2.3459 3.7241 2.5732 3.7096 1.5465 2.0955 2.8853 1.1515 3.9580 3.6449 1.4076 1.4349 5.1680 3.5658 3.0325 6.2356 2.7214 3.1454 9.2482 1.7366 1.8609 3.2088 3.4214 5.2381 2.1432 2.5107 1.7219 2.0784 1.6707 1.7950 5.5566 2.4345 1.6908 2.1953 2.0884 2.0401 1.4576 1.3272 1.7399 2.9571 1.4315 1.2536 1.3364 1.6726 2.1913 1.8928 1.3654 2.0719 3.0075 1.0812 1.0834 1.0835 1.1031 5.1965 4.0542 1.2893 1.2202 1.0644 1.0635 1.0612 1.0675 1.0975 1.1025 1.0907 1.0995 1.1006 1.0753 1.0442 1.0445 1.1036 1.1033
irintensity: 3.9160 2.0925 0.5258 2.4295 0.4395 11.4487 24.0496 53.3252 4.3406 62.5249 4.4626 139.8390 49.6978 8.7239 96.6592 0.4136 3.9153 39.3331 210.5978 26.9039 10.7400 3.9478 15.8158 7.5686 2.6949 16.9427 2.2101 0.9086 2.5145 1.5521 3.2120 8.8977 6.9412 1.7196 3.7406 8.0620 9.4276 65.5861 0.1023 7.5427 3.1746 2.9302 4.8425 4.9479 4.0763 54.9538 45.2910 8.0979 20.9405 2.7548 19.4744 51.4861 35.3791 49.3284 13.0377 33.9297 11.4391 11.3445 11.5001 23.7772 431.6938 153.7569 146.1194 263.4288 28.9801 33.4965 56.2730 19.2578 18.7211 7.3272 15.8739 67.1312 58.9889 17.7967 59.7936 26.9426 32.0178 28.7519
temp: 298.150 k
press: 1.00000 atm
elementType: 7 7 7 7 7 7 6 6 6 6 6 6 6 6 1 1 1 1 1 1 1 1 1 1 1 1 1 1
symmnumber: 1
zpe: 603570.7 jmol-1
zpe.correction: 0.229888 hartree
zpe.thermalcorrener: 0.243887 hartree
zpe.thermalcorrenthalpy: 0.244831 hartree
zpe.thermalcorrgfe: 0.188828 hartree
zpe.sumelectzpe: -640.645669 hartree
zpe.sumelectthermal: -640.631670 hartree
zpe.sumelectthermalent: -640.630726 hartree
zpe.sumelectthermalfe: -640.686729 hartree
dipole: -1.3869 8.0647 -0.0676
dipole: 8.1834
quadrupole: -71.5677 -85.1266 -85.1169
quadrupole: 18.3196 1.2912 -1.1869
quadrupole: 9.0361 -4.5229 -4.5132 18.3196 1.2912 -1.1869
hfenergy: -640.8755569 hartree
pointgroup: C01 [X(C8H14N6)]
dipole: 0.7118768 -3.1207936 -0.3459336 debye
polarizability: 182.1464135|4.7477144|131.2462332|-11.7290659|2.507961|84.451112 unknown
InChI: InChI=1S/C8H14N6/c9-6-7(10)12-14-13-8(6)11-5-3-1-2-4-5/h5,11H,1-4,9-10H2
charge 0 multiplicity 1
28 atoms
N  0.857826 -0.404335 -0.460457
N  -0.67564 1.370766 -0.134001
N  -1.236095 -2.342595 -0.152208
N  -1.942414 1.823472 0.133752
N  -2.981995 0.956836 0.316867
N  -3.888685 -1.204664 0.387745
C  1.987434 0.543865 -0.601891
C  2.484562 1.099945 0.762995
C  3.23172 -0.208318 -1.131189
C  3.413509 -0.009375 1.345109
C  3.844402 -0.899026 0.12561
C  -0.436941 0.002246 -0.208422
C  -1.483569 -0.955913 -0.059069
C  -2.765695 -0.413153 0.202531
H  1.649569 1.357543 -1.263677
H  3.057328 2.027549 0.572784
H  1.641967 1.367513 1.420546
H  2.991082 -0.912547 -1.948212
H  3.941239 0.53721 -1.534151
H  2.878814 -0.615206 2.099179
H  4.288524 0.431061 1.854856
H  4.941652 -0.989438 0.042218
H  3.454662 -1.929652 0.239078
H  1.081415 -1.380554 -0.251412
H  -0.664051 -2.717798 -0.906149
H  -1.763244 -3.001639 0.415402
H  -4.765523 -0.711076 0.550974
H  -3.917652 -2.157116 0.031289
