program: Gaussian 09
title: 000286189
version: EM64L-G09RevD.01
frameworkgroup: C1[X(C22H26N4O2S3)]
method: RPBEPBE
basis: SDD
operation: Freq
keyword: #p
keyword: freq=noraman
keyword: PBEPBE/SDD
title: #p freq=noraman PBEPBE/SDD
converged: YES YES NO NO
title: Mulliken charges:
elementType: S S S O O N N N N C C C C C C C C C C C C C C C C C C C C C C H H H H H H H H H H H H H H H H H H H H H H H H H H
charge: 0.861282 0.140906 0.140855 -0.537517 -0.537495 -0.159443 -0.159540 0.256861 0.256770 -0.061207 -0.061148 0.287439 0.287422 0.323602 0.323720 -0.367397 -0.401550 -0.367501 -0.401093 -0.381618 -0.381776 -0.289442 -0.289374 -0.305030 -0.304969 -0.654849 -0.663963 -0.654743 -0.664068 -0.718946 -0.718916 0.215893 0.242741 0.227878 0.237127 0.215902 0.242834 0.227699 0.237099 0.295687 0.295652 0.278734 0.278778 0.247685 0.247669 0.245354 0.208920 0.222146 0.235817 0.218505 0.224989 0.245187 0.208828 0.222263 0.235805 0.218550 0.224987
chargesum: 0.00000
title: Mulliken charges with hydrogens summed into heavy atoms:
elementType: S S S O O N N N N C C C C C C C C C C C C C C C C C C C C C C
charge: 0.861282 0.140906 0.140855 -0.537517 -0.537495 -0.159443 -0.159540 0.256861 0.256770 -0.061207 -0.061148 0.287439 0.287422 0.323602 0.323720 0.091236 0.063455 0.091235 0.063706 -0.085931 -0.086124 -0.010708 -0.010596 -0.057346 -0.057300 0.021571 0.015347 0.021535 0.015275 -0.718946 -0.718916
polarizability: 4.92494969e+02 8.01636282e+01 4.40489377e+02 3.06641967e-02 4.60306451e-02 2.52938224e+02
1716.lowfreq: -6.7127 -5.6836 -0.0020 0.0004 0.0011 2.8580 5.6772 10.5718 16.2456
frequency: 5.6306 10.5018 16.2334 20.9105 21.8696 31.5462 34.8021 51.8669 70.8452 80.4631 81.9901 87.2123 100.8277 128.7469 130.2863 133.5045 147.2471 151.0220 163.6503 183.7667 188.6145 193.0395 194.2252 205.1760 206.1390 217.0780 217.1710 237.6523 245.8496 263.8168 291.4013 305.5084 310.9137 325.4341 335.4620 352.2628 353.7920 372.3377 395.1561 397.7959 402.3904 404.1880 414.2837 437.5560 437.6370 440.1653 472.7897 473.3983 482.6327 491.6381 495.7975 557.5098 561.5039 578.9272 584.9618 600.8811 613.5953 648.5875 649.9736 722.6408 727.3890 736.0677 739.7478 780.0476 781.5488 782.1784 789.3976 790.2857 809.7275 810.0527 882.5430 882.8744 907.2102 909.0887 913.8846 919.4049 920.6443 922.3032 925.5360 952.6806 953.3695 1011.6842 1011.9357 1067.5230 1067.6268 1073.6196 1075.2820 1075.6213 1080.3370 1095.9488 1096.0404 1128.2366 1129.5261 1156.7103 1157.1323 1193.0513 1193.4245 1233.6485 1233.9840 1254.8243 1254.9553 1269.2398 1270.0122 1290.7895 1290.8588 1342.3462 1342.4434 1351.2219 1351.7590 1362.8855 1363.6665 1385.4808 1387.5424 1390.4328 1390.4673 1392.6877 1392.7347 1414.5387 1414.6385 1467.8272 1467.8522 1469.1120 1469.2020 1472.5446 1472.6824 1483.2201 1483.3604 1485.4671 1486.6752 1495.1350 1495.6313 1509.2480 1510.6600 1566.4981 1570.2923 1591.0911 1591.4718 2148.2661 2150.4129 2979.6502 2979.9000 2987.2806 2987.3514 2990.0187 2990.0611 3004.6557 3004.7268 3054.0149 3054.0670 3074.4004 3074.4114 3082.6834 3082.7787 3093.4304 3093.5104 3099.2270 3099.3156 3110.1154 3110.1913 3153.5948 3154.2530 3155.3845 3156.1568 3188.1503 3188.3003
redmass: 7.4233 8.2545 4.6863 4.6941 3.8549 9.3712 10.8639 4.3979 3.6596 6.2766 5.0859 6.7096 4.4442 3.8769 3.4174 3.7521 4.5037 3.6031 3.0818 1.8224 2.5523 1.2547 1.1738 1.5058 1.6696 3.5589 4.0726 6.9892 8.0632 7.6395 3.9576 3.6113 3.8926 3.3215 5.4915 3.3989 4.8817 4.4444 7.5662 5.7747 8.1004 10.1625 3.9383 5.4059 3.9702 5.0088 3.2718 3.7278 5.1769 3.8627 4.6869 3.3644 3.5030 4.5688 4.5816 4.4478 4.5959 6.2294 6.2281 5.8294 4.4812 3.4321 4.3499 2.8565 1.1551 1.5032 1.2169 1.3295 1.5389 1.5848 2.6039 2.5770 1.5686 1.5253 4.6154 2.4804 2.6298 3.8335 7.5096 1.3596 1.3473 2.9501 2.9606 2.2356 2.2574 2.0383 1.8797 1.9336 2.1022 1.7394 1.7388 2.1057 2.1330 1.8723 1.8675 1.7550 1.7693 3.2442 3.2151 1.4666 1.4950 1.3329 1.3266 1.2706 1.2695 1.2472 1.2473 1.3198 1.3225 3.2906 3.2322 4.3519 4.0211 1.2304 1.2313 1.2188 1.2259 2.5864 2.6265 1.0476 1.0477 1.0483 1.0475 1.0842 1.0750 1.0594 1.0560 1.4274 1.3564 1.1858 1.1899 1.6128 1.7409 8.3563 8.1472 6.0365 5.9722 12.8294 12.8330 1.0698 1.0697 1.0361 1.0361 1.0381 1.0381 1.0616 1.0616 1.1016 1.1016 1.0975 1.0975 1.0995 1.0995 1.1010 1.1010 1.0929 1.0930 1.0996 1.0996 1.0912 1.0921 1.0900 1.0910 1.0931 1.0932
irintensity: 0.5727 1.0762 0.9094 0.0383 0.8735 0.0404 0.1741 0.2775 0.1009 0.0870 0.5937 2.5358 0.0654 2.8900 0.2841 2.4090 0.0246 5.7248 0.0005 0.9775 1.0706 1.4299 0.0450 0.2555 3.9589 2.8777 0.6521 13.0702 1.2824 1.7845 4.1528 1.0779 0.1844 0.0141 8.0178 0.5036 3.2689 3.4020 1.7488 8.6318 13.3414 2.6278 41.5219 3.6820 0.7157 11.5106 47.1833 3.2924 191.6695 2.9330 46.6481 0.5854 2.9282 22.0551 30.9804 0.0851 85.2525 0.1627 21.6496 3.0677 12.4725 0.6933 26.7564 51.7621 28.8740 38.3339 22.1750 45.8471 13.9521 33.9678 19.7202 0.7091 9.2058 22.3638 13.3546 0.4477 41.0400 4.1102 74.8082 0.2300 1.7753 29.7101 19.2356 36.4605 0.8424 172.6640 11.0329 14.3192 31.2495 13.9299 19.8105 7.8829 35.1470 21.6993 5.6700 81.7921 0.7524 1.7946 6.1558 14.1259 62.3432 116.4925 32.4875 7.4628 36.3177 4.1484 6.0303 110.2890 41.3422 0.7474 35.6554 9.9184 48.7758 9.3763 11.9604 18.8466 50.3329 29.0512 48.0147 1.1684 4.4165 25.4132 21.6773 16.2810 0.1783 6.3311 1.7589 200.0616 12.5553 8.3868 78.9515 173.0273 47.9465 27.6576 95.3329 209.4735 114.8275 2246.8080 2.5476 27.0184 51.2199 22.9660 33.1584 52.0538 6.0404 94.4078 0.9037 4.5336 4.8569 10.6685 12.4480 45.0420 34.4384 60.5065 30.5079 20.0150 22.8247 34.9248 31.8354 1.3376 10.4088 3.6085 3.4057 20.2548 6.6720
temp: 298.150 k
press: 1.00000 atm
elementType: 16 16 16 8 8 7 7 7 7 6 6 6 6 6 6 6 6 6 6 6 6 6 6 6 6 6 6 6 6 6 6 1 1 1 1 1 1 1 1 1 1 1 1 1 1 1 1 1 1 1 1 1 1 1 1 1 1
symmnumber: 1
zpe: 1159767.1 jmol-1
zpe.correction: 0.441732 hartree
zpe.thermalcorrener: 0.475541 hartree
zpe.thermalcorrenthalpy: 0.476486 hartree
zpe.thermalcorrgfe: 0.370212 hartree
zpe.sumelectzpe: -2415.117628 hartree
zpe.sumelectthermal: -2415.083818 hartree
zpe.sumelectthermalent: -2415.082874 hartree
zpe.sumelectthermalfe: -2415.189148 hartree
dipole: 0.0008 0.0055 -9.7188
dipole: 9.7188
quadrupole: -183.8965 -202.6089 -227.1800
quadrupole: -49.2671 -0.0227 0.0181
quadrupole: 20.6653 1.9529 -22.6182 -49.2671 -0.0227 0.0181
hfenergy: -2415.5593597 hartree
pointgroup: C01[X(C22H26N4O2S3)]
dipole: 0.0009298 3.8235283 -0.0343607 debye
polarizability: 470.5053746|0.7298204|252.9560689|84.1767032|1.933594|462.4611272 unknown
InChI: InChI=1S/C22H26N4O2S3/c1-5-25(6-2)21-11-9-17(13-19(21)23-15-29)31(27,28)18-10-12-22(26(7-3)8-4)20(14-18)24-16-30/h9-14H,5-8H2,1-4H3
charge 0 multiplicity 1
57 atoms
S  0.000119 -2.66989 0.022387
S  5.285158 -0.022045 4.377655
S  -5.287356 -0.100215 -4.377299
O  0.251618 -3.428497 1.454907
O  -0.25125 -3.454474 -1.396059
N  4.881082 0.90492 -0.94657
N  -4.87907 0.923536 0.928975
N  4.200025 -0.100602 1.753979
N  -4.200176 -0.131095 -1.753478
C  1.484975 -1.546629 -0.254488
C  -1.484614 -1.541798 0.279287
C  3.776435 0.094479 -0.682736
C  -3.775301 0.107467 0.679119
C  3.413591 -0.370469 0.645087
C  -3.413366 -0.381453 -0.640306
C  5.536979 1.796589 0.045486
C  5.366272 1.089816 -2.33591
C  -5.535102 1.797241 -0.078891
C  -5.36261 1.134607 2.315162
C  2.262034 -1.177163 0.844015
C  -2.262006 -1.19176 -0.825326
C  1.825937 -1.182485 -1.567757
C  -1.825009 -1.154334 1.586005
C  2.950698 -0.369022 -1.764649
C  -2.949265 -0.33695 1.768788
C  6.911594 1.292318 0.53504
C  4.689259 2.253938 -3.099158
C  -6.91323 1.288055 -0.553212
C  -4.682898 2.311131 3.056663
C  4.629876 -0.095493 2.887033
C  -4.630839 -0.146578 -2.886127
H  5.663885 2.785327 -0.440361
H  4.860819 1.957677 0.897794
H  6.453427 1.283307 -2.276074
H  5.255632 0.14144 -2.890643
H  -5.656781 2.796155 0.387104
H  -4.861339 1.938624 -0.936623
H  -6.44947 1.328944 2.252676
H  -5.253041 0.196216 2.886814
H  2.022213 -1.548223 1.846114
H  -2.022577 -1.580527 -1.820784
H  1.22931 -1.542019 -2.412282
H  -1.22816 -1.499043 2.436543
H  3.188538 -0.068099 -2.786168
H  -3.186563 -0.017798 2.784876
H  6.817238 0.333191 1.069565
H  7.61197 1.149103 -0.308009
H  7.360905 2.030178 1.224663
H  3.600865 2.102318 -3.199399
H  4.848083 3.215476 -2.578473
H  5.120797 2.344975 -4.112768
H  -6.824545 0.316211 -1.065255
H  -7.612146 1.167927 0.294635
H  -7.360848 2.011602 -1.258907
H  -3.594947 2.15869 3.160481
H  -4.838956 3.263062 2.517851
H  -5.114766 2.422444 4.068108
