program: Gaussian 09
title: 000286091
version: EM64L-G09RevD.01
frameworkgroup: C1[X(C10H7Br2N)]
method: RPBEPBE
basis: SDD
operation: Freq
keyword: #p
keyword: freq=noraman
keyword: PBEPBE/SDD
title: #p freq=noraman PBEPBE/SDD
converged: YES YES NO YES
title: Mulliken charges:
elementType: Br Br N C C C C C C C C C C H H H H H H H
charge: 0.006000 0.004531 -0.688138 0.263408 0.603842 0.506268 -0.515392 -0.359031 -0.415651 -0.522649 -0.196162 -0.270530 -0.247010 0.199328 0.255753 0.266610 0.232717 0.234900 0.324604 0.316603
chargesum: 0.00000
title: Mulliken charges with hydrogens summed into heavy atoms:
elementType: Br Br N C C C C C C C C C C
charge: 0.006000 0.004531 -0.046931 0.263408 0.603842 0.506268 -0.515392 -0.159703 -0.159898 -0.522649 0.070448 -0.037813 -0.012110
polarizability: 2.19203923e+02 -1.07442997e+01 1.90181533e+02 -5.96775822e-03 -4.22320000e-03 5.18077372e+01
1716.lowfreq: -3.6070 -0.0005 -0.0004 -0.0003 7.3673 10.0342 64.1666 104.9924 112.1431
frequency: 64.1596 104.9886 112.1377 127.0145 173.4464 229.1311 241.8691 283.8977 332.2210 337.1219 341.1955 423.5478 473.2747 475.3670 494.3422 539.9857 574.5141 586.3557 639.2597 672.0605 710.3418 760.0868 794.8048 802.6786 873.0063 875.0435 897.4669 952.9892 994.5118 1019.1617 1039.2817 1111.4007 1155.0957 1183.0287 1200.3852 1257.2759 1281.8567 1353.3916 1388.5965 1402.9399 1434.4878 1451.5706 1516.0747 1564.3820 1584.0408 1622.1017 1638.7797 3124.8376 3140.8779 3156.5117 3171.1594 3182.6825 3554.2927 3706.6399
redmass: 5.5905 3.2149 6.9649 26.7163 8.9867 4.3785 15.2071 9.0260 3.2585 3.8783 1.5408 2.3654 5.9441 1.3441 2.7628 5.0286 5.3582 3.4454 8.9645 4.5985 5.4362 1.4450 2.5667 5.4826 1.3785 1.9884 5.2320 1.3825 1.3434 2.2679 2.4797 2.4022 1.7346 1.1073 1.9640 1.7142 1.8978 4.7677 2.5633 6.3529 2.5977 3.6318 3.8969 7.3821 4.9331 6.0953 1.3229 1.0857 1.0885 1.0940 1.1002 1.0929 1.0477 1.1006
irintensity: 0.5618 1.6489 3.5897 0.0757 0.6279 2.3179 3.7058 0.8520 22.4211 1.9337 29.6195 81.4024 0.6391 109.8196 21.1359 4.8422 3.7997 3.6230 48.7026 29.0227 12.2089 100.8064 0.0398 16.8500 15.1261 3.7904 28.1999 2.2360 0.3890 55.7397 8.6959 14.8114 4.0975 2.1885 9.3956 3.9312 1.6331 8.8275 83.7261 52.0854 7.2180 85.8675 12.3228 36.2567 11.2279 0.9301 285.2758 5.6695 11.8083 16.5535 25.0737 0.6550 80.2654 32.9260
temp: 298.150 k
press: 1.00000 atm
elementType: 35 35 7 6 6 6 6 6 6 6 6 6 6 1 1 1 1 1 1 1
symmnumber: 1
zpe: 371606.0 jmol-1
zpe.correction: 0.141537 hartree
zpe.thermalcorrener: 0.153125 hartree
zpe.thermalcorrenthalpy: 0.154069 hartree
zpe.thermalcorrgfe: 0.102177 hartree
zpe.sumelectzpe: -466.048772 hartree
zpe.sumelectthermal: -466.037184 hartree
zpe.sumelectthermalent: -466.036240 hartree
zpe.sumelectthermalfe: -466.088133 hartree
dipole: 0.8140 3.8372 0.0010
dipole: 3.9226
quadrupole: -85.7608 -79.2771 -100.6075
quadrupole: 1.7195 -0.0003 0.0024
quadrupole: 2.7876 9.2714 -12.0590 1.7195 -0.0003 0.0024
hfenergy: -466.1903093 hartree
pointgroup: C01 [X(C10H7Br2N1)]
dipole: 0.4438696 -1.478045 0.0003505 debye
dipolederiv: -0.097606 -0.1410828 0.0000336 -0.1179764 -0.6741212 0.0000836 -0.0000823 0.0002856 -0.032561 -0.7291095 -0.0956052 0.0002795 -0.123809 -0.1188098 0.0000432 0.0000595 0.0004628 -0.0309083 -0.3109564 -0.3684906 -0.000101 -0.4824923 -1.3987332 -0.0001171 0.0000758 -0.0007821 -0.6665517 0.1059038 -0.2939829 -0.0000611 0.2159038 -0.1294192 -0.0001058 0.000063 -0.0000727 -0.0012566 0.1733267 -0.2104818 0.0000157 -0.3242727 -0.2811051 0.0001532 -0.0000746 0.000161 0.1089398 -0.2737945 0.332527 0.0001747 0.4135824 1.3617829 0.000132 0.0000667 0.0001365 0.1526673 -0.2627409 0.2653162 -0.0000468 0.1673843 1.0896539 -0.0002052 0.0001767 -0.0004065 -0.2167718 -0.0927296 0.0798455 0.0000157 -0.0789371 -0.0076742 -0.0000178 -0.0000621 -0.0000562 -0.1630428 -0.1048747 0.0178884 0.000016 0.1195774 0.0516575 -0.0000154 -0.0000034 0.0000136 -0.1505477 1.2504097 0.4372926 -0.0005532 -0.1321617 -0.3554493 -0.0000533 -0.0003939 -0.0003849 -0.2138289 -0.1464716 -0.0928102 0.0000663 0.2395097 -0.0845096 0.0000219 0.0000649 0.0000232 0.0088482 -0.0459896 -0.1456513 -0.0000056 0.0038263 0.0579276 -0.0000453 0.000016 -0.0000085 -0.1603346 0.1091197 0.1097953 -0.0000567 0.0222432 0.0173567 -0.0000106 -0.0000583 -0.0000694 -0.1568538 0.0573556 -0.097385 0.0000296 -0.032691 -0.125325 0.0000483 0.0000162 0.0000696 0.1531587 0.0880523 -0.0236918 0.0000216 -0.0786156 -0.0138187 0.0000209 0.0000076 0.0000321 0.1576772 0.0576858 0.0690703 0.0000348 0.0569777 0.0531247 -0.0000169 0.0000324 -0.0000602 0.1563609 -0.018957 0.1050102 0.0000175 0.1154415 -0.0310427 0.0000038 0.0000063 0.0000291 0.1636549 -0.1206006 -0.0352347 0.0000592 -0.0486137 0.0784957 0.000014 0.0000526 0.0000155 0.1625253 0.2176045 0.033464 0.0000501 0.0041981 0.2587308 0.0000397 0.0000403 0.0002371 0.3676569 0.144372 0.0542068 0.00001 0.0609251 0.2512783 0.0000267 -0.0000034 0.0003745 0.3611682 unknown
polarizability: 221.5641164|6.4319892|187.8213252|-0.0507649|-0.0055386|51.8077522 unknown
InChI: InChI=1S/C10H7Br2N/c11-8-5-9(12)10(13)7-4-2-1-3-6(7)8/h1-5H,13H2
charge 0 multiplicity 1
20 atoms
Br 0.21894 3.556716 -0.0001
Br -3.954806 -0.409149 0.001727
N  -1.532454 -2.412873 0.000479
C  0.31345 -0.76029 0.000072
C  0.742121 0.628604 -0.000067
C  -1.104255 -1.095327 0.000385
C  -0.267326 1.649564 0.000182
C  1.318253 -1.781881 0.000035
C  2.146313 0.915328 -0.000303
C  -2.023221 -0.025946 0.000853
C  -1.624316 1.334694 0.000688
C  2.680176 -1.470393 -0.000243
C  3.097148 -0.10618 -0.000422
H  1.034225 -2.840067 0.000259
H  2.464456 1.962102 -0.000377
H  -2.382459 2.12064 0.001039
H  3.426073 -2.272054 -0.000258
H  4.1645 0.138199 -0.000633
H  -2.529849 -2.615351 0.000877
H  -0.879971 -3.188337 0.000704
