program: Gaussian 09
title: 000286092
version: EM64L-G09RevD.01
frameworkgroup: C1[X(C9H11ClN4O)]
method: RPBEPBE
basis: SDD
operation: Freq
keyword: #p
keyword: freq=noraman
keyword: PBEPBE/SDD
title: #p freq=noraman PBEPBE/SDD
converged: YES YES NO NO
title: Mulliken charges:
elementType: Cl O N N N N C C C C C C C C C H H H H H H H H H H H
charge: -0.054543 -0.290936 -0.039822 -0.228869 -0.028298 -0.657882 0.119667 0.134210 -0.294910 -0.282484 -0.123268 -0.207011 0.156814 -0.626252 -0.598124 0.307657 0.266728 0.254236 0.258008 0.231578 0.258352 0.237565 0.237610 0.265224 0.393535 0.311214
chargesum: 0.00000
title: Mulliken charges with hydrogens summed into heavy atoms:
elementType: Cl O N N N N C C C C C C C C C
charge: -0.054543 -0.290936 -0.039822 -0.228869 -0.028298 0.046867 0.119667 0.134210 0.012748 -0.015756 -0.123268 0.047225 0.156814 0.121686 0.142275
polarizability: 2.73484323e+02 -3.01005194e+00 1.52784132e+02 6.75756957e-02 -5.21774054e-02 6.34430588e+01
1716.lowfreq: -8.7175 -5.4657 -0.0030 -0.0023 -0.0015 4.9054 24.1869 52.2147 74.6663
frequency: 23.8775 52.2022 74.6572 85.5357 103.8208 143.2449 165.4600 165.7778 179.6003 236.8431 241.3637 260.7659 340.3402 365.5998 366.0785 385.2310 389.3990 433.5572 434.2561 534.2102 549.2622 589.5179 600.5900 612.4930 658.6199 694.5328 768.8900 772.1150 830.6716 837.7528 852.9504 896.2331 945.7004 972.9704 1036.4096 1054.7891 1072.3806 1084.4300 1091.6502 1128.7071 1128.8616 1149.2360 1194.4170 1239.9450 1289.7427 1322.4860 1331.0405 1356.6299 1382.9967 1399.5365 1417.7091 1441.8726 1448.9550 1451.0878 1469.2640 1483.0790 1491.4653 1558.3519 1569.3625 1588.6543 1618.1821 2973.4451 2979.2672 3053.2667 3054.6552 3119.2882 3128.7745 3157.5016 3163.5188 3178.3300 3242.7193 3615.6017
redmass: 2.9750 4.7047 5.0128 4.5450 1.7348 3.6981 9.3953 2.0478 1.3650 4.8345 2.7866 4.9411 5.0050 5.8164 5.9557 7.0821 4.5336 3.7712 3.4513 2.8759 4.7066 5.1988 1.4673 4.8924 6.8344 4.5845 5.6264 4.8704 5.4900 1.4112 1.1068 5.1398 1.3770 1.3407 1.4690 2.5995 1.9532 1.2464 3.7949 1.3494 1.8914 1.6137 2.8193 1.5481 3.4780 4.3517 3.0846 4.0497 8.0832 4.0356 1.1565 1.2801 1.0445 2.4485 1.0447 1.0613 1.1663 4.0251 1.6919 4.5553 7.2389 1.0347 1.0360 1.1007 1.1022 1.0996 1.0980 1.0882 1.0920 1.0966 1.0645 1.0892
irintensity: 1.1643 0.0460 4.7339 0.9166 2.9023 1.2644 2.9138 0.3922 4.1724 2.1485 1.1338 3.1827 22.6921 0.6822 0.8532 0.0682 7.0158 14.4686 13.5426 0.8608 27.5890 3.9024 141.1148 52.0750 8.0375 38.2186 11.9258 5.4725 6.2422 14.9071 107.9867 25.5272 13.0065 3.2273 14.0743 86.2583 74.5093 0.0182 12.7192 0.3300 1.1619 14.9617 1.2249 14.6015 4.4787 21.9398 74.2902 386.7910 40.3397 53.1711 26.9962 41.5169 21.6397 102.4210 11.7223 10.7367 78.9533 82.5075 132.6793 88.1026 147.2953 30.5201 92.8023 15.9962 31.7539 15.2795 9.0117 1.2613 7.5286 7.2717 336.6674 67.4349
temp: 298.150 k
press: 1.00000 atm
elementType: 17 8 7 7 7 7 6 6 6 6 6 6 6 6 6 1 1 1 1 1 1 1 1 1 1 1
symmnumber: 1
zpe: 514584.0 jmol-1
zpe.correction: 0.195995 hartree
zpe.thermalcorrener: 0.211022 hartree
zpe.thermalcorrenthalpy: 0.211966 hartree
zpe.thermalcorrgfe: 0.152450 hartree
zpe.sumelectzpe: -1102.713634 hartree
zpe.sumelectthermal: -1102.698607 hartree
zpe.sumelectthermalent: -1102.697662 hartree
zpe.sumelectthermalfe: -1102.757178 hartree
dipole: 9.4364 -3.4010 0.0285
dipole: 10.0306
quadrupole: -75.0704 -96.9726 -97.4633
quadrupole: 5.3002 0.0019 0.0640
quadrupole: 14.7650 -7.1371 -7.6279 5.3002 0.0019 0.0640
hfenergy: -1102.9096283 hartree
pointgroup: C01 [X(C9H11Cl1N4O1)]
dipole: -3.6967895 1.3639581 0.217055 debye
dipolederiv: -1.0309171 -0.162033 -0.0689428 -0.1664503 -0.1501863 -0.0245995 -0.0696203 -0.0244542 -0.077545 -0.7963826 0.1515665 0.0248846 0.3821499 -0.9633962 -0.130274 0.0799265 -0.1366001 -0.4058832 -1.7401692 0.3886708 0.0419102 -0.1335493 -0.1229059 0.0218525 -0.0791601 0.0400865 -0.2361953 -0.8852627 0.1857331 0.0212809 1.0975707 -0.4374585 -0.0352655 0.2278579 -0.0637803 -0.1480679 1.8003573 -0.4731962 -0.0517641 -0.3509061 -0.1770408 -0.0424961 -0.0238013 -0.0457889 -0.0453583 -0.992597 -0.0786054 -0.0287525 -0.1247274 -0.6238553 0.0001291 -0.0398504 0.0007135 -0.6370594 -0.0123881 -0.0475076 -0.0116925 -0.0030697 -0.3678612 -0.0895043 0.0000369 -0.0910274 -0.0170759 0.7402966 -0.1281744 -0.0074307 -0.0340779 0.0056446 -0.0002786 0.0179455 -0.0031121 0.0031402 -0.3472941 -0.0130468 -0.011857 -0.2744232 -0.0895422 -0.0139384 -0.075553 -0.0059372 -0.0713531 -0.1466528 -0.0467751 -0.0120453 -0.091807 -0.0325619 0.0208354 -0.0236362 0.0217809 -0.1246691 1.4033346 0.2585835 0.1081976 0.2804426 0.0859372 0.0484434 0.1129248 0.0484143 -0.0654268 -0.3133428 -0.0232896 -0.0126251 0.0433078 0.042104 0.0356623 0.0035692 0.0329875 -0.0903609 1.2810194 0.0957467 0.0517486 -0.1886411 1.3360002 0.2659789 -0.0157107 0.2744988 0.2691738 0.1812093 0.0373924 0.0073151 0.2207918 0.1447886 -0.0081598 0.0465965 -0.0143642 0.2136884 0.3824828 -0.2328289 -0.0484631 -0.5530399 0.2901234 -0.0054668 -0.1192229 0.0038902 0.2401791 0.1023745 0.0305534 0.0055184 0.0826222 0.1462276 -0.0007019 0.0181417 -0.0022205 0.1598543 0.0586401 0.0848027 0.017884 0.0483606 0.0154188 -0.0323578 0.0097159 -0.0307902 0.148265 0.0598608 -0.0565884 -0.0167346 -0.0629066 -0.021313 -0.0453734 -0.0179325 -0.0453706 0.1473588 0.0731069 0.0329469 0.0934042 -0.0921109 0.0323438 -0.040362 -0.0059925 -0.0593336 -0.0634398 -0.1497103 0.0003993 -0.0070887 0.0333719 0.0977553 -0.0057863 0.0008044 -0.0065152 0.1239881 0.0792123 0.0650102 -0.0656223 -0.0885028 -0.0224508 0.0541674 -0.0278897 0.0811244 -0.0115428 -0.1032509 0.060553 0.1111069 0.0678394 0.0443615 0.0670699 0.1862953 0.0028035 -0.0482042 -0.0879542 0.1011624 -0.0769904 0.1423691 0.0521851 -0.0101371 -0.1403364 0.0522437 -0.0696513 0.0839696 -0.1233435 -0.0287411 -0.0333417 -0.0013315 -0.0309055 -0.008719 -0.0340067 0.1262045 0.2037334 -0.1263457 -0.0330181 -0.2356242 0.5916983 0.0570491 -0.0589073 0.0608453 0.3306929 0.1563244 0.0186136 -0.0014825 0.0343518 0.1253155 -0.0555807 0.0025179 -0.0560875 0.3492879 unknown
polarizability: 273.2085809|-5.6593307|148.1407762|5.2915791|19.9720134|68.3621564 unknown
InChI: InChI=1S/C9H11ClN4O/c1-14(2)13-12-8-4-3-6(10)5-7(8)9(11)15/h3-5H,11H2,1-2H3
charge 0 multiplicity 1
26 atoms
Cl 4.830085 0.964681 0.307742
O  1.730411 -3.164867 -0.781346
N  -3.239878 0.757014 -0.00175
N  -1.150035 -0.04304 -0.119131
N  -1.913845 1.010149 0.096122
N  -0.521044 -2.587454 -0.7049
C  1.174978 -0.85676 -0.242537
C  0.257063 0.221528 -0.012708
C  2.567838 -0.609393 -0.140176
C  0.769171 1.511727 0.313168
C  3.035791 0.669467 0.181442
C  2.15013 1.744145 0.412209
C  0.818963 -2.294772 -0.598069
C  -3.773832 -0.578675 -0.316093
C  -4.132138 1.898891 0.227863
H  3.240035 -1.453563 -0.322302
H  0.063679 2.328236 0.487547
H  2.534752 2.737041 0.66328
H  -3.407166 -0.922459 -1.301789
H  -4.873023 -0.523569 -0.331673
H  -3.450672 -1.314962 0.443738
H  -4.800829 1.711251 1.088648
H  -4.752344 2.101923 -0.665141
H  -3.507808 2.779011 0.441041
H  -1.195321 -1.818761 -0.53974
H  -0.782863 -3.543685 -0.940243
