program: Gaussian 09
title: 000286110
version: EM64L-G09RevD.01
frameworkgroup: C1[X(C13H10Cl4O4)]
method: RPBEPBE
basis: SDD
operation: Freq
keyword: #p
keyword: freq=noraman
keyword: PBEPBE/SDD
title: #p freq=noraman PBEPBE/SDD
converged: YES YES NO NO
title: Mulliken charges:
elementType: Cl Cl Cl Cl O O O O C C C C C C C C C C C C C H H H H H H H H H H
charge: 0.072791 0.068457 0.061096 0.062780 -0.233140 -0.269042 -0.161320 -0.159959 -0.369650 -0.355758 0.415994 -0.183889 -0.208820 -0.022068 -0.042281 0.101411 0.107980 -0.247993 -0.246661 -0.531042 -0.525515 0.325685 0.355790 0.268003 0.267602 0.244105 0.235789 0.244627 0.236445 0.236029 0.252551
chargesum: 0.00000
title: Mulliken charges with hydrogens summed into heavy atoms:
elementType: Cl Cl Cl Cl O O O O C C C C C C C C C C C C C
charge: 0.072791 0.068457 0.061096 0.062780 -0.233140 -0.269042 -0.161320 -0.159959 -0.369650 -0.355758 0.415994 0.141796 0.146970 -0.022068 -0.042281 0.101411 0.107980 0.020010 0.020941 0.193479 0.199510
polarizability: 1.78643526e+02 1.16349488e+00 2.17708836e+02 -9.51304326e+00 -3.16071111e+00 1.45469230e+02
1716.lowfreq: -9.4283 -0.0015 -0.0009 0.0017 0.6571 8.3721 43.3360 68.1199 72.0605
frequency: 43.3291 68.1147 72.0594 81.0621 83.7181 115.6304 120.0062 124.9789 134.5947 148.3180 151.9735 154.5080 162.8122 177.8086 182.3211 198.6897 224.0576 246.5352 272.7735 306.1496 315.6692 331.2513 334.5141 340.9673 378.2674 395.2892 450.8393 455.0453 476.9538 491.7251 587.2359 590.1029 601.0537 628.2871 659.6305 707.3713 714.2737 737.2549 799.6096 811.4832 842.9031 864.9003 869.8842 922.3031 927.0154 966.1416 983.0561 988.1479 1008.8164 1015.3105 1036.8647 1054.5881 1080.8618 1107.2133 1115.0375 1117.1637 1143.8107 1145.2319 1157.4070 1165.6217 1228.5221 1235.3448 1250.8624 1260.0913 1290.1238 1291.6332 1361.7070 1424.3136 1434.6152 1457.0572 1462.5807 1471.6486 1480.0391 1571.3391 1585.5578 1604.0104 1613.6086 2993.9638 2995.3091 3056.3529 3072.1043 3098.0685 3101.1104 3126.3725 3129.0009 3134.5536 3159.1153
redmass: 11.5068 6.3478 5.6499 10.1758 13.7539 2.6404 2.6507 2.6460 4.0364 2.1133 4.6484 24.6429 5.4752 1.7019 7.5038 6.8192 8.5268 5.2672 8.5822 4.0285 4.3005 15.3854 22.3130 15.1940 10.3056 10.1424 8.5197 5.9072 5.7351 5.7406 8.6535 5.6134 8.4963 4.0545 6.0688 7.1361 5.6862 4.6541 6.2016 7.4386 7.5062 2.0577 8.4636 6.7936 5.7125 6.8966 6.7554 5.7016 1.3204 3.6227 5.7672 6.0571 3.0500 1.6083 1.4781 1.4222 2.7472 2.7563 1.5766 1.7036 1.9564 1.8240 1.6307 1.6573 1.8576 1.8689 1.9841 1.1208 1.1487 1.0547 1.0575 1.0488 1.0506 11.7018 9.6906 11.9862 7.1831 1.0288 1.0293 1.0846 1.0843 1.1041 1.1048 1.1048 1.1051 1.0867 1.0997
irintensity: 0.1283 2.8233 9.2136 1.8378 0.3154 3.8089 0.6799 1.3627 0.4758 1.0328 0.9331 0.2845 0.5827 1.4582 0.6805 3.4823 3.7478 2.3527 0.3181 12.4788 15.1921 0.2998 0.5308 2.3416 9.6867 5.3178 14.1669 0.5737 1.6970 5.9497 3.2338 13.9779 24.1193 13.6300 1.8441 23.9377 7.8771 14.0470 12.2730 1.0731 30.2474 35.5554 23.6471 27.0306 9.4483 54.1195 8.2988 15.0701 1.4789 62.2741 31.4399 146.4405 46.1600 41.5853 20.4174 27.9475 39.9878 82.5648 26.9667 34.0472 15.0327 9.8134 28.6078 66.9171 19.1271 30.4811 5.0273 9.6444 7.2817 9.9372 2.4508 22.6644 16.5317 58.7050 210.6985 43.9852 13.6672 36.9656 45.8658 1.2679 0.4046 24.6959 20.2343 17.5194 12.2045 0.0398 6.5296
temp: 298.150 k
press: 1.00000 atm
elementType: 17 17 17 17 8 8 8 8 6 6 6 6 6 6 6 6 6 6 6 6 6 1 1 1 1 1 1 1 1 1 1
symmnumber: 1
zpe: 533998.3 jmol-1
zpe.correction: 0.203389 hartree
zpe.thermalcorrener: 0.224395 hartree
zpe.thermalcorrenthalpy: 0.225339 hartree
zpe.thermalcorrgfe: 0.153737 hartree
zpe.sumelectzpe: -2640.874204 hartree
zpe.sumelectthermal: -2640.853198 hartree
zpe.sumelectthermalent: -2640.852254 hartree
zpe.sumelectthermalfe: -2640.923856 hartree
dipole: 2.4587 -0.1123 -0.2965
dipole: 2.4791
quadrupole: -126.8417 -168.5663 -149.7110
quadrupole: -1.9964 -4.9412 6.7014
quadrupole: 21.5313 -20.1933 -1.3380 -1.9964 -4.9412 6.7014
hfenergy: -2641.077593 hartree
pointgroup: C01 [X(C13H10Cl4O4)]
dipole: 0.9202512 0.0637735 0.3168284 debye
polarizability: 173.1418451|1.1358019|216.7004452|15.5119392|-8.8576795|151.9793024 unknown
InChI: InChI=1S/C13H10Cl4O4/c1-20-13(21-2)11(16)7-5(18)3-4-6(19)8(7)12(13,17)10(15)9(11)14/h3-4,7-8H,1-2H3
charge 0 multiplicity 1
31 atoms
Cl 1.00821 2.843892 -0.514091
Cl 1.127918 -2.774478 0.700139
Cl -0.590009 1.154184 -2.977007
Cl -0.490128 -2.303942 -2.257712
O  2.658763 0.133517 -0.540912
O  1.878016 0.245216 1.712004
O  -2.211405 2.812501 0.48001
O  -2.116486 -2.49943 1.476898
C  0.442069 1.113689 -0.244234
C  0.5018 -1.109842 0.219822
C  1.533261 0.102839 0.325313
C  -0.67721 0.965367 0.87009
C  -0.65044 -0.5796 1.180689
C  0.007537 0.368804 -1.502201
C  0.047269 -0.962382 -1.226516
C  -2.014964 1.564248 0.431385
C  -1.960146 -1.345822 0.98288
C  -3.081535 0.64513 -0.040769
C  -3.054386 -0.700217 0.212142
C  3.70218 -0.897885 -0.325197
C  2.760119 1.38613 2.061474
H  -0.325954 1.527175 1.751904
H  -0.297951 -0.751322 2.210686
H  -3.938416 1.122764 -0.531015
H  -3.888841 -1.355448 -0.065811
H  3.844394 -1.099915 0.750732
H  4.615406 -0.468468 -0.764396
H  3.427939 -1.829742 -0.847143
H  3.249248 1.09063 3.001926
H  2.162049 2.301736 2.210657
H  3.506988 1.560173 1.268953
