program: Gaussian 09
title: 000286083
version: EM64L-G09RevD.01
frameworkgroup: C1[X(C8H14N2O)]
method: RPBEPBE
basis: SDD
operation: Freq
keyword: #p
keyword: freq=noraman
keyword: PBEPBE/SDD
title: #p freq=noraman PBEPBE/SDD
converged: NO YES NO NO
title: Mulliken charges:
elementType: O N N C C C C C C C C H H H H H H H H H H H H H H
charge: -0.284811 -0.395931 -0.506226 -0.176109 -0.174994 -0.357451 -0.412764 -0.442281 -0.430769 -0.389141 0.240315 0.273074 0.272810 0.222410 0.203269 0.203405 0.215001 0.199920 0.199156 0.211831 0.205915 0.202075 0.314448 0.303407 0.303440
chargesum: 0.00000
title: Mulliken charges with hydrogens summed into heavy atoms:
elementType: O N N C C C C C C C C
charge: -0.284811 -0.081482 0.100620 0.096965 0.097816 -0.135041 -0.006089 -0.027360 -0.019782 0.018849 0.240315
polarizability: 1.27085777e+02 3.70279290e-01 8.55278857e+01 1.79665688e+00 8.78748405e-01 8.68351775e+01
1716.lowfreq: -15.2692 0.0000 0.0005 0.0005 2.0017 9.7897 48.1442 76.8899 100.9994
frequency: 47.8591 76.8222 100.9955 142.2591 158.0166 211.6886 253.3630 276.9013 285.4504 336.4714 406.6671 434.2949 478.2318 541.0452 624.3520 683.0588 721.4055 775.1607 785.9980 789.6723 827.8941 842.9380 873.2980 907.5044 943.0675 954.4054 991.8299 1006.0982 1044.3034 1077.7022 1083.7042 1093.3815 1126.4135 1138.4526 1152.7169 1171.0525 1220.7293 1241.7855 1250.2362 1265.0160 1285.5535 1311.7165 1318.6778 1328.5112 1338.4409 1348.9309 1353.8244 1416.1858 1445.9642 1461.5048 1467.4702 1470.7454 1479.7770 1601.9457 1681.0203 2967.3217 2969.9329 2973.4709 2975.3765 3020.0355 3031.6286 3035.9533 3045.7956 3098.7232 3112.4137 3128.3123 3388.1596 3501.1616 3552.6339
redmass: 4.4112 2.9905 3.9376 1.2957 2.9009 2.4670 3.4858 3.8452 2.5994 1.7065 3.7333 2.7523 3.9469 1.1738 2.0500 4.2691 3.6944 3.3227 1.7509 1.8317 2.6058 2.9583 2.0008 2.2218 1.9521 1.7681 3.3029 1.7754 1.6156 1.2516 1.7960 1.7593 1.4486 1.4831 1.8459 1.3835 1.4021 1.8598 1.2677 1.2256 1.1576 1.7661 1.2897 1.5186 1.4827 1.5252 1.4756 2.2998 2.0110 1.1461 1.0826 1.0970 1.0952 6.8820 1.0617 1.0593 1.0666 1.0603 1.0652 1.0990 1.0965 1.0981 1.1037 1.0901 1.0878 1.0907 1.0428 1.0984 1.0793
irintensity: 1.5589 0.4217 0.9544 14.9150 0.2897 11.6708 5.1784 24.4202 4.7493 1.1636 3.5273 1.2115 1.0803 162.7461 3.0603 0.6703 1.9949 33.6650 3.8060 109.9585 0.9867 6.5800 8.4641 1.3390 4.4419 7.3806 31.8001 9.6154 1.5771 9.9723 0.5966 8.4720 16.0409 0.6220 28.4069 6.6346 19.1112 24.1641 0.9051 4.4639 0.2948 51.1783 0.8651 1.9804 4.3990 1.8263 1.4584 22.9394 224.0674 25.8745 18.4356 4.0435 11.3116 143.3439 30.1160 42.7832 33.5822 26.4814 40.5161 47.2320 27.7844 67.8572 74.1517 12.5845 7.8496 11.9697 0.0174 1.1136 29.8082
temp: 298.150 k
press: 1.00000 atm
elementType: 8 7 7 6 6 6 6 6 6 6 6 1 1 1 1 1 1 1 1 1 1 1 1 1 1
symmnumber: 1
zpe: 564957.0 jmol-1
zpe.correction: 0.215181 hartree
zpe.thermalcorrener: 0.226353 hartree
zpe.thermalcorrenthalpy: 0.227297 hartree
zpe.thermalcorrgfe: 0.177956 hartree
zpe.sumelectzpe: -497.067965 hartree
zpe.sumelectthermal: -497.056792 hartree
zpe.sumelectthermalent: -497.055848 hartree
zpe.sumelectthermalfe: -497.105189 hartree
dipole: 1.8122 -0.4582 -2.0912
dipole: 2.8048
quadrupole: -66.0470 -64.8023 -69.3863
quadrupole: 0.2399 1.4334 -1.0447
quadrupole: 0.6982 1.9429 -2.6411 0.2399 1.4334 -1.0447
hfenergy: -497.2831453 hartree
pointgroup: C01 [X(C8H14N2O1)]
dipole: 0.7317059 0.0783047 -0.8222998 debye
dipolederiv: -0.7553205 -0.007355 0.1824832 0.0086386 -0.378683 0.0633873 0.0699407 0.0690623 -0.9040168 -0.4350525 0.0457762 -0.3524864 0.0795159 -0.4662101 0.0204834 -0.6116696 0.0333353 -0.5003181 -0.2627856 0.0300359 -0.1477716 0.0473707 -0.031769 0.0550684 -0.2670872 0.0600255 -0.3862309 0.2754365 -0.0368867 0.0114353 0.0729799 0.0031723 0.0465412 0.2903125 -0.0038076 0.1029959 0.1957845 0.0304322 -0.0111069 -0.178396 -0.0060283 -0.0653559 0.1714031 -0.0314725 0.0787699 -0.9707511 0.0582766 -0.1166764 0.1115396 -0.0611214 0.0069936 -0.3281738 0.0069528 -0.0776917 0.0711599 -0.0507242 0.0543078 0.0036731 0.097479 0.0205233 -0.0411531 0.0417781 0.1056927 0.0638159 0.0418524 0.0494582 0.0277526 0.1014865 -0.0192917 -0.03104 -0.0408928 0.1215832 0.0793736 -0.0190162 0.0402627 -0.0188603 0.0314238 -0.025646 0.0229632 -0.029875 0.0897732 0.0984987 -0.0112425 -0.0007147 -0.0342424 0.0403993 -0.054769 0.0247483 -0.0365384 0.1202866 1.5552618 -0.093965 0.2370009 -0.0983275 0.2033066 -0.1454485 0.2596353 -0.1490432 1.1909547 -0.0017829 -0.0270914 0.081983 -0.0019723 0.0055596 0.0461014 0.0424111 0.0728018 0.0146666 -0.0033948 -0.0023644 0.0768819 -0.0099956 0.0314577 -0.050965 0.0331837 -0.0665535 -0.0116402 -0.0001135 -0.005935 0.0243513 -0.0098799 0.0987794 0.0363396 0.0215895 0.0328247 -0.1134979 0.0169982 -0.0806853 -0.0413333 -0.0504804 -0.118301 -0.0902847 -0.001709 -0.1550127 -0.0089813 -0.0872277 0.1085389 -0.0786405 0.0669537 0.0126775 0.0635319 -0.0559723 0.1009205 -0.0618677 -0.0071795 -0.0525192 -0.0254385 -0.0576227 -0.0699177 -0.1120978 -0.0302916 -0.1528472 -0.0369747 -0.0009196 0.0315064 -0.0522438 0.0202972 -0.0165958 0.0688301 -0.0095801 0.1623186 -0.0839909 0.0191162 0.0058979 -0.1350302 -0.0015377 0.011504 0.085693 -0.0942326 0.0566001 -0.111677 -0.1316543 0.1084813 0.1004307 0.1112256 -0.0227816 -0.0653959 0.0763199 -0.0532942 0.040932 0.0213685 0.041659 -0.0642772 0.0851079 0.0123919 0.0620553 -0.1222243 0.0375957 -0.1153692 -0.1187838 -0.1104796 0.0767707 -0.1208582 -0.0346223 0.0528862 0.1249584 0.0609561 0.0250543 0.0721271 0.0034693 0.0606968 -0.0025549 0.3346024 0.0232014 0.1036778 0.0209334 0.14636 0.1488083 -0.0472096 0.0050421 -0.0624579 0.1456534 -0.0983073 0.1641608 -0.1631475 0.1563841 0.1572167 0.0395483 0.0246147 0.012131 0.0761369 0.0759257 0.1878292 0.1263799 0.2188034 unknown
polarizability: 126.9166258|-1.9647618|85.2091359|2.5417554|0.1551956|87.3230787 unknown
InChI: InChI=1S/C8H14N2O/c9-10-8(11)7-5-3-1-2-4-6(5)7/h5-7,10H,1-4,9H2
charge 0 multiplicity 1
25 atoms
O  -2.161909 0.132108 1.422779
N  -2.624203 0.454914 -0.832106
N  -4.03468 0.495048 -0.663228
C  0.648456 -0.656564 0.680641
C  0.718273 0.856755 0.88448
C  -0.291616 0.262052 -0.13841
C  1.798962 -1.39569 -0.000714
C  1.927886 1.657448 0.3768
C  2.732338 -0.461599 -0.812216
C  3.147162 0.762134 0.036269
C  -1.739227 0.27371 0.230669
H  0.125484 -1.211185 1.469132
H  0.232673 1.226778 1.794406
H  -0.049106 0.407745 -1.19884
H  1.403302 -2.205534 -0.645304
H  2.401674 -1.886382 0.790759
H  2.217249 2.397584 1.146243
H  1.643625 2.240601 -0.522271
H  2.227719 -0.117626 -1.738634
H  3.625647 -1.029624 -1.134505
H  3.614365 0.400747 0.974605
H  3.910909 1.362678 -0.494245
H  -2.292476 0.567896 -1.790693
H  -4.294387 1.27589 -0.042854
H  -4.368421 -0.393885 -0.262763
