program: Gaussian 09
title: 000286079
version: EM64L-G09RevD.01
frameworkgroup: C1[X(C13H18O4)]
method: RPBEPBE
basis: SDD
operation: Freq
keyword: #pfreq=noraman
keyword: PBEPBE/SDD
title: #p freq=noraman PBEPBE/SDD
converged: YES YES NO NO
title: Mulliken charges:
elementType: O O O O C C C C C C C C C C C C C H H H H H H H H H H H H H H H H H H
charge: -0.262685 -0.264946 -0.235230 -0.252325 -0.231685 -0.235929 0.043696 -0.458309 -0.458834 0.173463 0.240364 -0.194642 -0.204557 -0.261179 -0.256230 -0.660889 -0.666929 0.281662 0.281413 0.215399 0.236064 0.245921 0.215951 0.201901 0.209110 0.234591 0.220951 0.234348 0.222871 0.213443 0.218737 0.255549 0.216347 0.233609 0.248978
chargesum: 0.00000
title: Mulliken charges with hydrogens summed into heavy atoms:
elementType: O O O O C C C C C C C C C C C C C
charge: -0.262685 -0.264946 -0.235230 -0.252325 0.049976 0.045483 0.043696 -0.006846 0.003038 0.173463 0.240364 0.007260 0.004554 0.194363 0.200989 0.026840 0.032006
polarizability: 1.65385092e+02 1.16220494e+00 1.43826999e+02 2.02619089e+00 -3.41780251e+00 1.31333375e+02
1716.lowfreq: -1.9515 0.0002 0.0007 0.0007 5.3745 9.4421 36.3863 43.9141 51.2252
frequency: 36.3714 43.8604 51.2096 61.0970 81.6551 90.3531 107.3110 113.3194 125.6689 159.6891 181.5031 210.1536 215.4298 255.1697 265.1221 300.0914 323.4348 350.9658 378.8066 403.6800 439.0233 455.1462 503.6839 538.6315 571.5379 647.3032 666.2597 667.6529 713.3885 740.8395 784.8899 797.1218 803.6610 814.9666 819.9075 845.2783 894.8007 914.8223 923.0922 929.6659 955.8516 971.2949 985.9762 1004.9767 1016.3648 1045.7451 1068.0634 1082.6101 1096.3278 1097.0703 1132.7233 1155.8464 1156.8034 1166.3000 1175.8529 1205.2109 1213.3771 1228.3108 1277.3523 1277.6369 1303.7103 1325.8583 1344.8892 1350.1510 1354.8617 1358.1168 1384.7864 1389.8438 1391.5282 1397.1978 1450.0475 1451.2201 1456.5962 1457.2774 1461.6810 1463.3881 1482.2626 1484.9054 1614.6477 1625.4910 1684.0671 2964.5029 2966.8614 2991.3016 2993.4955 3011.4713 3013.3902 3028.8825 3030.9515 3084.4784 3088.9645 3093.7076 3094.6254 3098.2205 3118.5902 3120.5708 3121.2645 3129.4530 3133.6777
redmass: 3.5484 3.5616 3.5694 2.8534 3.2611 4.2603 4.4490 4.2262 3.3076 3.3038 3.4553 1.2507 1.3722 3.3512 3.1964 2.4835 3.3965 5.5664 1.9793 4.1357 4.0776 3.3677 4.5588 4.9923 5.8425 4.0507 5.2148 1.4443 3.7421 3.2515 3.7045 2.6011 2.3605 1.7893 1.5574 4.3609 2.4505 2.6702 2.1990 3.2583 1.7653 2.5151 1.4714 2.4283 2.4414 3.2334 2.6568 1.4753 2.1671 2.1392 1.2173 1.6635 1.6675 1.9906 1.3019 1.6556 1.1530 1.4203 1.1208 1.1193 2.2115 1.3076 1.9194 2.1798 1.3068 1.3987 1.5566 1.2324 1.2386 2.9625 1.0802 1.1121 1.0982 1.0921 1.0452 1.0432 1.0530 1.0518 9.8602 9.9328 6.4209 1.0629 1.0623 1.0361 1.0362 1.0958 1.0967 1.0591 1.0595 1.0979 1.0973 1.1030 1.1032 1.0841 1.1055 1.1061 1.0879 1.0963 1.0940
irintensity: 0.8444 1.1342 1.9443 0.4800 0.1846 0.3409 0.2715 1.5055 1.2492 0.9233 5.0206 2.2663 2.1380 2.4650 3.2177 7.7178 17.8374 5.6573 0.0530 7.7444 1.3145 1.0339 1.9238 0.2399 2.8240 6.6319 8.7976 74.3728 9.0156 3.8357 9.4407 11.0827 1.8372 9.5379 0.7971 1.5585 0.9313 2.9356 14.7159 7.2316 1.4386 1.1937 0.1783 34.0268 106.1176 24.6753 213.0894 0.3127 18.0662 23.1255 3.7546 18.6066 15.4229 184.9209 114.7962 252.8278 6.3730 71.2172 5.5528 3.3354 77.3034 1.5775 6.1492 0.5352 4.0793 8.1690 0.7122 19.9069 25.6721 25.3175 32.6572 0.7709 19.0027 16.7425 16.2031 15.4508 17.5019 14.1222 217.5698 97.2003 4.0306 33.7574 37.1520 20.5010 19.1179 18.0329 7.1998 26.1074 34.8394 38.1416 36.4744 4.0065 0.7792 7.2188 30.8120 29.0738 5.4449 52.6687 6.1557
temp: 298.150 k
press: 1.00000 atm
elementType: 8 8 8 8 6 6 6 6 6 6 6 6 6 6 6 6 6 1 1 1 1 1 1 1 1 1 1 1 1 1 1 1 1 1 1
symmnumber: 1
zpe: 752793.2 jmol-1
zpe.correction: 0.286724 hartree
zpe.thermalcorrener: 0.304627 hartree
zpe.thermalcorrenthalpy: 0.305571 hartree
zpe.thermalcorrgfe: 0.239886 hartree
zpe.sumelectzpe: -805.736613 hartree
zpe.sumelectthermal: -805.718710 hartree
zpe.sumelectthermalent: -805.717766 hartree
zpe.sumelectthermalfe: -805.783450 hartree
dipole: -0.6124 1.4594 -0.8250
dipole: 1.7848
quadrupole: -88.4841 -95.2109 -102.6739
quadrupole: 3.8685 2.7198 -5.2168
quadrupole: 6.9722 0.2454 -7.2176 3.8685 2.7198 -5.2168
hfenergy: -806.0233366 hartree
pointgroup: C01 [X(C13H18O4)]
dipole: 0.0407406 0.6549699 0.2498422 debye
polarizability: 163.8323586|4.8071724|145.7101804|3.7262906|2.5407901|131.0029276 unknown
InChI: InChI=1S/C13H18O4/c1-3-16-11(14)13(12(15)17-4-2)9-7-5-6-8-10(9)13/h5-6,9-10H,3-4,7-8H2,1-2H3
charge 0 multiplicity 1
35 atoms
O  0.018621 1.81155 0.423723
O  -2.533325 0.063706 -0.122428
O  0.137715 0.960802 -1.747649
O  -2.065752 -1.99463 0.879509
C  0.729461 -1.126304 1.239519
C  0.705159 -1.757798 -0.14728
C  -0.236668 -0.550589 0.155338
C  1.940318 -0.326854 1.709707
C  1.885731 -1.583395 -1.09894
C  0.005462 0.778409 -0.515326
C  -1.674443 -0.92264 0.352621
C  2.965013 -0.053102 0.62605
C  2.942105 -0.610523 -0.61204
C  0.166285 3.197843 -0.119269
C  -4.000097 -0.220164 -0.025674
C  1.643662 3.564254 -0.286975
C  -4.473725 -1.022961 -1.240001
H  0.192047 -1.673136 2.022324
H  0.162681 -2.705595 -0.233913
H  2.427576 -0.895592 2.529371
H  1.605495 0.629441 2.158172
H  1.521051 -1.259683 -2.094137
H  2.355586 -2.57751 -1.250036
H  3.776863 0.638857 0.889171
H  3.732059 -0.355983 -1.331402
H  -0.372762 3.254494 -1.081147
H  -0.334211 3.824753 0.636273
H  -4.190928 -0.76166 0.917463
H  -4.452455 0.783587 0.011465
H  1.731118 4.617008 -0.614967
H  2.188119 3.452974 0.666948
H  2.120975 2.921971 -1.045274
H  -5.572643 -1.141947 -1.202656
H  -4.212575 -0.505204 -2.178795
H  -4.018718 -2.027479 -1.246745
