program: Gaussian 09
title: 000286069
version: EM64L-G09RevD.01
frameworkgroup: C1[X(C12H14O2)]
method: RPBEPBE
basis: SDD
operation: Freq
keyword: #pfreq=noraman
keyword: PBEPBE/SDD
title: #p freq=noraman PBEPBE/SDD
converged: NO YES NO NO
title: Mulliken charges:
elementType: O O C C C C C C C C C C C C H H H H H H H H H H H H H H
charge: -0.186195 -0.186107 -0.254095 -0.314257 -0.199707 -0.198903 0.227888 0.227784 -0.189804 -0.189906 -0.782939 -0.783137 -0.253456 -0.253168 0.268515 0.294012 0.228158 0.228243 0.209900 0.209891 0.258327 0.251852 0.228317 0.252138 0.228373 0.258255 0.210001 0.210019
chargesum: 0.00000
title: Mulliken charges with hydrogens summed into heavy atoms:
elementType: O O C C C C C C C C C C C C
charge: -0.186195 -0.186107 0.039917 -0.045741 0.028451 0.029340 0.227888 0.227784 0.020096 0.019984 -0.044442 -0.044371 -0.043455 -0.043149
polarizability: 1.19023264e+02 -3.66205359e-02 1.42274339e+02 -1.61587691e+01 3.49744563e-02 1.23635803e+02
1716.lowfreq: -5.6765 -0.0004 0.0000 0.0003 7.0290 11.8636 20.3264 48.9123 61.7224
frequency: 11.9750 48.5039 61.7217 84.4501 105.4589 113.5070 127.7985 147.2525 188.8389 232.6334 244.9185 326.2351 338.3727 372.0549 396.6402 441.8456 479.6123 483.7417 558.7424 567.5363 603.7786 634.7017 698.5469 758.0239 761.3473 813.5177 833.8057 845.3323 892.9625 895.2784 928.4406 935.1078 953.9716 954.0764 965.3500 984.0051 987.2995 996.7498 1039.4155 1074.5941 1097.5658 1144.9508 1172.5745 1214.8044 1224.5242 1230.0330 1234.2918 1262.3785 1309.6410 1338.8132 1355.1869 1361.8592 1369.0374 1395.8447 1436.9714 1438.9676 1445.0562 1446.8786 1456.5557 1555.9248 1612.2301 1616.8594 1622.7604 1649.2170 2978.4849 2980.2887 3040.6506 3061.7694 3063.1411 3065.0325 3084.1919 3089.4467 3100.6788 3121.1852 3121.4176 3122.4319 3129.4039 3135.8952
redmass: 3.4972 4.6423 3.8803 5.1331 3.0519 1.2074 1.0337 4.3979 4.4772 5.0924 3.7375 3.0999 3.1791 3.3318 3.0656 5.0820 3.4429 3.1295 3.4029 3.4094 3.1213 3.4323 1.4417 1.4004 2.7375 1.8829 3.2088 4.3235 4.2950 2.7712 2.6962 1.9802 1.5880 2.0083 1.3530 1.9241 1.3098 1.7343 2.2049 3.1866 1.7580 2.2769 2.0159 1.2158 1.0618 1.2014 1.4690 1.4607 1.5374 1.2318 1.3191 1.2439 1.2323 1.4941 1.0693 1.8078 1.0656 1.0545 1.0558 8.9512 4.7216 7.1046 6.8022 8.6571 1.0373 1.0375 1.0843 1.0956 1.0859 1.0938 1.0821 1.0852 1.0872 1.1004 1.0944 1.1002 1.0956 1.0974
irintensity: 0.9408 2.2063 9.9948 0.3559 0.2339 0.1458 0.2260 2.9103 3.5072 0.3246 1.9703 1.7078 0.5830 1.0658 6.3682 0.7680 0.9809 2.1946 5.1966 16.7960 13.0111 1.2835 114.3586 12.9438 18.9611 3.2035 1.0733 18.3181 2.9831 6.0969 1.7833 40.3639 1.0109 0.3785 0.9616 0.1132 0.0851 0.1290 2.8700 10.9127 0.0044 105.0531 43.9479 5.8158 2.5626 18.5257 155.7695 38.0450 4.7429 10.7594 1.1239 29.8686 86.3684 9.2965 3.4921 0.9064 21.4657 11.8916 29.0898 0.5869 2.2274 47.9910 10.7877 150.6209 0.0517 5.0028 7.6659 6.1677 7.1542 12.0414 3.1708 2.4103 12.9811 16.8009 43.5756 13.0138 34.7443 13.5468
temp: 298.150 k
press: 1.00000 atm
elementType: 8 8 6 6 6 6 6 6 6 6 6 6 6 6 1 1 1 1 1 1 1 1 1 1 1 1 1 1
symmnumber: 1
zpe: 592002.5 jmol-1
zpe.correction: 0.225482 hartree
zpe.thermalcorrener: 0.240069 hartree
zpe.thermalcorrenthalpy: 0.241013 hartree
zpe.thermalcorrgfe: 0.182189 hartree
zpe.sumelectzpe: -615.030684 hartree
zpe.sumelectthermal: -615.016097 hartree
zpe.sumelectthermalent: -615.015153 hartree
zpe.sumelectthermalfe: -615.073977 hartree
dipole: -1.9434 0.0281 4.5876
dipole: 4.9823
quadrupole: -86.8709 -81.1537 -81.8298
quadrupole: 0.0145 7.8601 -0.0127
quadrupole: -3.5861 2.1311 1.4551 0.0145 7.8601 -0.0127
hfenergy: -615.256166 hartree
pointgroup: C01 [X(C12H14O2)]
dipole: 0.951066 0.030645 -1.713733 debye
polarizability: 122.514544|-0.8270346|142.2379823|-16.2624308|-0.8219593|120.1808794 unknown
InChI: InChI=1S/C12H14O2/c1-9(13)12(10(2)14)11-7-5-3-4-6-8-11/h3-8,11-12H,1-2H3
charge 0 multiplicity 1
28 atoms
O  -1.994148 -1.78094 0.855731
O  -2.126419 1.657963 0.832468
C  0.228505 0.026234 1.086485
C  -0.662813 -0.014572 -0.195365
C  1.076968 1.287538 1.168808
C  1.166625 -1.168773 1.184884
C  -1.520271 -1.308877 -0.207753
C  -1.608617 1.216842 -0.223906
C  2.059911 1.633528 0.267069
C  2.172332 -1.454156 0.287171
C  -1.729608 -1.979517 -1.556577
C  -1.848763 1.868312 -1.576972
C  2.628329 0.796539 -0.776259
C  2.678958 -0.591582 -0.767203
H  -0.043829 0.001042 -1.108916
H  -0.472943 0.005913 1.93652
H  0.850579 1.979216 1.990446
H  0.99013 -1.864835 2.014976
H  2.500667 2.636365 0.365576
H  2.684295 -2.42122 0.398062
H  -2.475209 -2.785494 -1.474647
H  -0.766924 -2.408118 -1.898257
H  -2.045952 -1.251221 -2.325977
H  -0.913355 2.358194 -1.911729
H  -2.110204 1.119158 -2.346899
H  -2.646428 2.623842 -1.504372
H  3.188819 1.314224 -1.567344
H  3.276163 -1.077206 -1.55172
