program: Gaussian 09
title: 000286145
version: EM64L-G09RevD.01
frameworkgroup: C1[X(C24H14N2O7)]
method: RPBEPBE
basis: SDD
operation: Freq
keyword: #p
keyword: freq=noraman
keyword: PBEPBE/SDD
title: #p freq=noraman PBEPBE/SDD
converged: YES YES NO NO
title: Mulliken charges:
elementType: O O O O O O O N N C C C C C C C C C C C C C C C C C C C C C C C C H H H H H H H H H H H H H H
charge: -0.209903 -0.177206 -0.155362 -0.145259 -0.117973 -0.227791 -0.232988 -0.250716 -0.296298 -0.071621 -0.476756 0.533970 0.276238 0.144781 -0.178457 0.065363 0.057297 0.205806 0.208423 0.286926 -0.416824 0.063089 0.088876 -0.385322 -0.338225 -0.305151 -0.189303 0.236043 -0.243969 -0.214852 0.234781 -0.750769 -0.748361 0.336318 0.245790 0.243853 0.314629 0.313544 0.236757 0.236906 0.236956 0.268051 0.255904 0.259482 0.263268 0.257057 0.263000
chargesum: 0.00000
title: Mulliken charges with hydrogens summed into heavy atoms:
elementType: O O O O O O O N N C C C C C C C C C C C C C C C C C C C C C C C C
charge: -0.209903 -0.177206 -0.155362 -0.145259 -0.117973 -0.227791 -0.232988 -0.250716 -0.296298 -0.071621 -0.140438 0.533970 0.276238 0.144781 -0.178457 0.065363 0.057297 0.205806 0.208423 0.286926 -0.171034 0.063089 0.088876 -0.141470 -0.023596 0.008393 0.047454 0.236043 -0.007063 0.022104 0.234781 0.032668 0.034964
polarizability: 4.00537640e+02 5.22970377e+00 2.98344713e+02 2.59291598e+00 7.33037894e+00 2.20846957e+02
1716.lowfreq: -0.0006 -0.0003 0.0007 2.8078 3.2062 5.7546 24.2396 31.0911 38.4964
frequency: 24.2309 31.0844 38.4962 54.2626 55.8879 61.5333 67.9940 88.4325 109.0381 121.1903 125.8330 135.2380 146.0103 165.4654 173.4419 184.6049 196.3526 214.9893 224.6280 237.1930 262.3097 271.0604 290.9151 316.7612 326.3997 329.0887 337.8492 365.8258 368.7643 393.1768 400.3633 419.1849 446.9548 475.0369 482.7750 492.1299 499.7397 528.7064 548.7814 557.2709 568.1292 570.4910 577.7752 580.2438 604.9894 616.9339 635.8082 651.8838 674.7687 681.0456 690.9533 699.4914 728.5370 743.5845 744.9398 769.9068 779.2186 782.7137 794.2060 801.9445 817.6680 842.8234 868.9798 889.4797 903.7943 909.2171 928.5166 944.6754 957.2821 962.9866 997.8593 998.6843 1000.7749 1010.6965 1026.8507 1034.3957 1038.8440 1039.7127 1045.2986 1049.1564 1073.9669 1094.5074 1120.3872 1146.5164 1161.1706 1174.9886 1180.9113 1191.9879 1203.0490 1215.0600 1231.4011 1243.0158 1256.4165 1266.8940 1274.3742 1283.6881 1307.6071 1313.9051 1390.0518 1390.5562 1396.4398 1399.0874 1431.2362 1431.6020 1442.1592 1448.8388 1448.9346 1451.3121 1467.7606 1478.0580 1593.0162 1599.0173 1609.1169 1612.3814 1624.2133 1629.4346 1656.7249 1661.4036 1665.9345 1695.1644 1749.0509 2898.5427 3008.7021 3009.2495 3094.8848 3094.9164 3137.5183 3137.8034 3138.0752 3140.8866 3149.0173 3161.3705 3169.0346 3216.4189 3219.1458
redmass: 6.4182 6.2533 6.1053 5.3311 10.9409 4.7138 5.3510 6.7447 4.9301 9.5555 8.0304 7.7967 14.0100 5.4561 1.0435 1.0805 6.4065 5.9058 6.5031 8.5068 6.6917 8.0463 9.2588 6.6662 6.2057 6.6936 5.6844 4.5369 4.8688 7.1223 7.8219 6.5814 4.2254 6.0583 7.3137 5.4005 7.5926 4.4683 5.1094 3.9987 9.4917 4.3475 5.0824 4.1242 4.6823 5.5414 7.0716 6.1207 6.9631 6.3568 8.2287 8.7807 8.5499 4.5801 4.1797 1.7492 2.7467 4.6538 8.9297 5.4311 2.1523 6.6202 6.3096 1.5207 3.9512 4.9363 1.4366 4.6316 3.4975 1.5785 1.6690 2.0147 1.3578 3.3976 4.2408 2.1805 1.7083 1.7210 3.9843 3.2865 2.6789 3.2444 3.3754 3.1943 2.2057 1.1142 1.3729 3.4265 2.6601 3.8356 2.5215 2.7015 1.8572 3.2834 2.2636 5.5326 1.7943 3.7128 1.2734 1.2444 5.8741 6.2930 1.0889 1.0869 3.3035 1.0462 1.0459 2.5267 2.8453 3.1883 8.1696 7.5780 8.1469 7.5043 9.0171 9.0537 12.0954 11.6781 11.8350 13.0581 13.0086 1.0786 1.0366 1.0367 1.0960 1.0960 1.1023 1.0871 1.1022 1.0884 1.0918 1.0956 1.0987 1.0949 1.0950
irintensity: 0.4002 0.0287 0.2827 1.6969 0.4528 4.5193 8.7610 0.1533 0.6071 1.7201 3.5301 0.2645 1.5582 1.1943 0.3906 0.6798 1.6595 0.4304 7.8764 1.0715 3.2306 4.7235 2.3872 5.0974 19.2803 2.3634 3.0982 2.3817 3.4901 2.2756 4.0706 1.2559 8.2505 9.9860 0.4252 5.0411 12.2519 2.1551 6.7641 19.3506 55.0669 4.8145 44.1498 6.2499 0.6964 2.5227 6.8243 6.0987 16.1492 8.0060 8.6428 60.0525 10.0743 3.8671 9.5334 48.1526 56.5839 13.9842 221.6933 19.7724 39.8399 4.5141 10.5111 9.5229 17.0598 9.9743 4.3199 137.8503 4.5648 0.9927 19.4428 42.5932 2.9288 17.5009 22.3022 4.3051 7.1241 4.5984 35.0818 2.9227 29.1872 112.0869 63.3034 147.6044 134.8530 0.3777 15.1937 27.4423 135.7790 174.0909 13.4760 9.7394 33.3304 445.8395 7.7587 357.0062 115.4780 18.1536 45.9842 46.3295 89.1051 43.9574 57.3633 24.1797 85.7057 20.4593 20.0634 51.7711 62.1659 4.8874 126.5188 50.1312 28.8503 12.3676 208.8333 182.4507 156.7475 182.7617 34.4553 435.1409 261.7665 13.6528 0.6852 0.4683 2.7733 2.9691 17.3464 0.8847 15.2768 2.8637 13.3463 11.7168 17.2073 4.7107 3.5527
temp: 298.150 k
press: 1.00000 atm
elementType: 8 8 8 8 8 8 8 7 7 6 6 6 6 6 6 6 6 6 6 6 6 6 6 6 6 6 6 6 6 6 6 6 6 1 1 1 1 1 1 1 1 1 1 1 1 1 1
symmnumber: 1
zpe: 862036.0 jmol-1
zpe.correction: 0.328332 hartree
zpe.thermalcorrener: 0.355201 hartree
zpe.thermalcorrenthalpy: 0.356145 hartree
zpe.thermalcorrgfe: 0.270826 hartree
zpe.sumelectzpe: -1556.824933 hartree
zpe.sumelectthermal: -1556.798064 hartree
zpe.sumelectthermalent: -1556.797120 hartree
zpe.sumelectthermalfe: -1556.882440 hartree
dipole: 0.8414 -5.1136 1.0655
dipole: 5.2907
quadrupole: -201.6297 -211.7890 -176.4837
quadrupole: 3.6760 0.6625 2.8369
quadrupole: -4.9956 -15.1548 20.1504 3.6760 0.6625 2.8369
hfenergy: -1557.1532656 hartree
pointgroup: C01 [X(C24H14N2O7)]
dipole: 0.2930343 2.0185628 -0.415143 debye
polarizability: 400.4657707|-3.5704046|298.137143|-6.6017185|7.7726631|221.1263967 unknown
InChI: InChI=1S/C24H14N2O7/c1-10(27)25-15-9-5-7-13-16(15)17(20(25)29)18-19(22(31)33-21(18)30)24(13)12-6-3-4-8-14(12)26(11(2)28)23(24)32/h3-9,19H,1-2H3
charge 0 multiplicity 1
47 atoms
O  -0.351262 -3.687918 0.522343
O  -2.104602 0.537741 2.513812
O  -2.455817 -2.713591 0.830055
O  4.188709 -1.713899 -0.161732
O  1.952478 -4.020146 0.141713
O  -5.53001 1.137533 0.020541
O  5.248533 2.45075 -0.226652
N  -3.301781 0.59869 0.434023
N  3.779207 0.66406 -0.034527
C  -0.956696 0.004355 0.371651
C  -0.380643 -1.326899 0.956161
C  0.16204 1.06949 0.399411
C  -1.58832 -0.079047 -1.011007
C  0.998949 -1.745354 0.487028
C  1.492183 0.615828 0.313225
C  -2.163385 0.412698 1.27021
C  1.926377 -0.762419 0.256778
C  -2.95337 0.297515 -0.939798
C  -1.230931 -2.584079 0.762527
C  2.602355 1.480113 0.14018
C  -0.041096 2.466958 0.372546
C  3.408419 -0.750948 -0.014358
C  1.04599 -3.216356 0.36034
C  -1.00588 -0.430272 -2.239802
C  2.41117 2.872498 0.123974
C  -3.766443 0.329415 -2.089098
C  1.072978 3.337671 0.259114
C  -4.626112 0.958537 0.875292
C  -1.810849 -0.413978 -3.404366
C  -3.171209 -0.036536 -3.321448
C  5.097263 1.201238 -0.223855
C  -4.86418 1.093476 2.362704
C  6.242343 0.230985 -0.409495
H  -0.327818 -1.153564 2.058869
H  -1.051035 2.885824 0.432894
H  0.051116 -0.710764 -2.301124
H  3.247901 3.560193 0.005345
H  -4.8143 0.620713 -2.02465
H  0.898792 4.419081 0.255655
H  -1.378532 -0.692289 -4.370799
H  -3.785618 -0.024881 -4.228061
H  -4.62844 0.154241 2.892156
H  -5.923802 1.352551 2.504101
H  -4.218989 1.86598 2.814308
H  6.339414 -0.453234 0.450699
H  7.161516 0.823356 -0.52799
H  6.089588 -0.413515 -1.291994
