program: Gaussian 09
title: 000286089
version: EM64L-G09RevD.01
frameworkgroup: C1[X(C23H24NP)]
method: RPBEPBE
basis: SDD
operation: Freq
keyword: #p
keyword: freq=noraman
keyword: PBEPBE/SDD
title: #p freq=noraman PBEPBE/SDD
converged: YES YES NO NO
title: Mulliken charges:
elementType: P N C C C C C C C C C C C C C C C C C C C C C C C H H H H H H H H H H H H H H H H H H H H H H H H
charge: 0.834856 -0.540225 -0.101584 -0.421552 -0.472876 -0.442993 -0.409056 -0.101562 -0.036095 -0.023450 -0.250371 -0.290076 -0.304094 -0.297067 -0.306105 -0.299982 -0.243103 -0.229617 -0.227558 -0.223765 -0.236201 -0.242298 -0.229328 -0.232414 -0.229078 0.184910 0.224666 0.202398 0.220027 0.205803 0.205079 0.203245 0.204907 0.206456 0.237852 0.263576 0.279325 0.317107 0.264475 0.254614 0.229897 0.232289 0.232001 0.230618 0.232922 0.231209 0.229137 0.231870 0.231214
chargesum: 0.00000
title: Mulliken charges with hydrogens summed into heavy atoms:
elementType: P N C C C C C C C C C C C C C C C C C C C C C C C
charge: 0.834856 -0.540225 0.083325 0.005513 -0.047047 -0.034669 0.002306 -0.101562 -0.036095 -0.023450 -0.012519 -0.026500 -0.024770 0.020040 -0.041631 -0.045368 -0.013206 0.002672 0.004442 0.006853 -0.003279 -0.011088 -0.000191 -0.000544 0.002136
polarizability: 2.76092155e+02 -1.64488769e+01 2.76492026e+02 -1.54828991e+00 -6.49516543e+00 2.83075372e+02
1716.lowfreq: -8.4399 -4.3214 0.0005 0.0007 0.0019 0.7351 19.0409 23.8124 31.7109
frequency: 18.4934 23.2651 31.4926 40.7302 41.4089 48.3404 49.1534 57.0543 65.9692 77.8927 131.4764 145.1478 175.4519 193.9580 206.8900 221.8750 226.9629 246.7633 270.6352 306.3033 390.9833 393.6984 399.7677 405.0572 414.2509 441.7690 464.7418 493.4751 512.5637 514.2587 554.5337 607.2647 611.5530 612.7911 613.6721 661.3413 677.2024 695.8883 699.8259 701.0554 707.5401 752.5034 754.9663 757.4225 762.4065 788.4862 822.0734 856.1496 861.7009 869.3245 877.4276 892.9448 928.2276 935.1151 938.0694 942.1335 963.0589 972.1625 980.7524 985.9746 986.9456 987.5648 988.1867 991.2850 1000.0717 1005.4679 1012.1973 1017.1797 1017.8475 1020.5165 1058.9567 1067.0296 1071.9861 1073.9958 1077.5260 1081.0339 1086.4917 1091.7383 1113.6627 1158.6975 1166.8291 1170.8098 1172.4506 1173.7521 1181.4494 1185.0099 1193.2422 1194.2804 1231.5646 1257.2314 1271.1937 1284.5668 1293.5503 1302.3858 1304.1652 1307.1498 1314.2745 1331.0760 1372.8698 1376.5941 1381.2848 1422.3801 1426.5475 1427.6801 1460.7943 1462.2816 1464.7853 1465.5252 1468.9668 1470.0759 1488.4658 1581.1882 1585.1661 1587.5093 1592.0235 1592.7127 1596.2751 2861.8574 2984.4570 2991.6813 2993.1764 3008.3398 3035.3259 3053.3918 3060.3515 3075.8247 3117.6706 3122.0661 3122.5189 3123.2432 3127.7478 3129.7485 3134.2004 3138.1330 3139.6814 3145.8345 3148.4904 3149.7046 3162.0528 3163.1565 3163.8536
redmass: 3.5692 3.0577 4.0124 3.5997 4.3449 2.2305 3.3708 4.2335 4.3825 4.1370 4.1724 3.0747 4.2665 4.1929 4.4521 5.0604 5.4811 5.2159 4.5399 4.4425 3.7296 3.1607 2.8751 2.9015 5.8738 4.4446 2.9486 3.8687 4.5224 4.9989 4.6050 2.7611 6.4577 6.3821 6.2007 6.6111 6.7370 6.1495 2.0535 1.9574 2.2091 1.6746 1.5425 1.3202 1.5962 2.0768 2.7275 1.2519 1.2483 1.2464 3.5978 2.2924 1.3708 1.3910 1.5071 1.3843 1.7403 1.3223 1.4224 3.3844 3.9460 4.5180 1.7390 1.5867 1.3159 1.3125 1.3225 3.3450 3.4373 2.8203 2.6209 1.9313 1.8805 2.1491 1.8999 1.6649 3.2007 2.7830 6.1464 1.3540 1.4713 1.0658 1.0573 1.0549 1.1265 1.1286 1.2149 1.3754 1.1759 1.2953 1.2411 1.2659 1.2845 1.3670 1.3910 1.3308 1.3328 1.3670 7.1312 8.5947 9.3307 2.1033 2.1207 2.1358 2.0373 1.0825 2.0531 2.0308 1.0865 1.0819 1.0977 5.8136 6.1063 6.2337 5.8301 5.8184 5.9088 1.0827 1.0590 1.0623 1.0593 1.0653 1.1005 1.1018 1.1045 1.1048 1.0873 1.0858 1.0850 1.0855 1.0873 1.0881 1.0909 1.0920 1.0920 1.0958 1.0963 1.0963 1.1013 1.1015 1.1016
irintensity: 0.1946 0.0346 0.0984 0.0071 0.1240 0.2072 0.0243 0.2682 0.7289 0.2889 3.2897 0.9947 0.8345 4.1882 3.2663 1.8246 0.0212 1.1774 1.2408 6.2795 4.7082 1.6747 0.7442 0.1923 11.3430 6.2597 11.9712 18.8011 90.0899 34.5237 52.5166 4.5133 0.0994 0.9206 0.3584 1.2377 22.8505 11.2674 49.2479 52.0250 41.6156 50.9692 21.5800 8.8797 36.3115 3.3697 3.3481 0.5808 0.0462 0.0697 2.6295 13.8982 0.8855 0.3723 9.0286 0.2171 3.5193 0.9637 0.2184 0.4910 0.3732 1.4208 0.4954 0.2085 0.0421 0.0070 0.1207 2.2529 1.5877 10.8805 0.9094 33.6890 31.1295 11.3338 4.0467 2.4130 20.7255 14.1480 141.1960 7.9873 6.6445 0.8157 0.0635 0.3073 7.5179 5.6750 1.8456 0.8199 1.2602 3.4326 1.3859 4.1561 3.2713 4.0766 3.2241 8.0884 1.7924 61.4618 0.0359 0.9158 1.8318 13.8862 31.3358 5.2468 13.4565 2.0023 7.8541 24.0840 4.7895 8.8270 5.4135 0.1048 0.4678 0.4868 2.3131 2.0636 2.3906 50.7963 14.7560 39.5555 66.1871 58.8490 19.8054 10.0933 20.7649 103.4214 0.2348 3.2633 1.8533 0.4534 0.1760 10.0994 3.4421 6.5780 6.2610 29.1529 29.3016 22.0613 48.0191 47.9223 25.1968
temp: 298.150 k
press: 1.00000 atm
elementType: 15 7 6 6 6 6 6 6 6 6 6 6 6 6 6 6 6 6 6 6 6 6 6 6 6 1 1 1 1 1 1 1 1 1 1 1 1 1 1 1 1 1 1 1 1 1 1 1 1
symmnumber: 1
zpe: 1055180.4 jmol-1
zpe.correction: 0.401897 hartree
zpe.thermalcorrener: 0.425032 hartree
zpe.thermalcorrenthalpy: 0.425976 hartree
zpe.thermalcorrgfe: 0.345471 hartree
zpe.sumelectzpe: -1284.991468 hartree
zpe.sumelectthermal: -1284.968334 hartree
zpe.sumelectthermalent: -1284.967389 hartree
zpe.sumelectthermalfe: -1285.047894 hartree
dipole: 2.0250 -0.4738 2.6668
dipole: 3.3818
quadrupole: -151.0630 -143.3491 -144.3541
quadrupole: -3.3514 -3.4365 1.1080
quadrupole: -4.8076 2.9063 1.9013 -3.3514 -3.4365 1.1080
hfenergy: -1285.3933652 hartree
pointgroup: C01 [X(C23H24N1P1)]
dipole: 0.3681816 0.1361266 1.2712977 debye
polarizability: 269.1533039|-12.9301728|278.2701271|-2.189041|-8.2126549|288.236121 unknown
InChI: InChI=1S/C23H24NP/c1-4-14-21(15-5-1)25(22-16-6-2-7-17-22,23-18-8-3-9-19-23)24-20-12-10-11-13-20/h1-9,14-20H,10-13H2
charge 0 multiplicity 1
49 atoms
P  0.213967 -0.084423 -0.150473
N  -0.476726 -0.11119 -1.684497
C  -1.835648 0.451936 -1.898483
C  -3.020694 -0.519749 -1.618677
C  -2.021336 0.772594 -3.409113
C  -4.20522 0.113294 -2.389923
C  -3.560161 0.755875 -3.668211
C  1.818052 -1.006509 -0.362339
C  -0.671833 -0.897343 1.310774
C  0.655607 1.650056 0.486988
C  2.698494 -1.207722 0.72598
C  -0.528521 -2.290233 1.527536
C  0.706315 2.673247 -0.488975
C  2.14505 -1.483278 -1.651785
C  -1.60769 -0.161148 2.080617
C  0.976557 1.937531 1.835131
C  3.914989 -1.898211 0.521546
C  -1.296165 -2.935992 2.521993
C  1.074481 3.985523 -0.117019
C  3.362479 -2.171619 -1.850152
C  -2.378705 -0.810505 3.07072
C  1.350857 3.250291 2.203417
C  4.248179 -2.380343 -0.765888
C  -2.223161 -2.198332 3.295421
C  1.398971 4.275124 1.229049
H  -2.020548 1.38774 -1.314663
H  -3.223001 -0.655519 -0.540588
H  -2.752941 -1.508189 -2.040473
H  -1.511164 -0.028164 -3.976807
H  -1.544587 1.729122 -3.689143
H  -4.68385 0.896732 -1.771138
H  -4.988557 -0.624846 -2.640056
H  -3.797612 0.165846 -4.572165
H  -3.956319 1.773878 -3.838212
H  2.444581 -0.838263 1.7265
H  0.178872 -2.868112 0.921837
H  0.466378 2.421386 -1.530042
H  1.429574 -1.300351 -2.461315
H  -1.737021 0.914195 1.911018
H  0.929143 1.151366 2.597615
H  4.598845 -2.056501 1.362728
H  -1.174593 -4.012026 2.689346
H  1.111681 4.777949 -0.872897
H  3.620296 -2.543774 -2.847959
H  -3.099795 -0.235673 3.662726
H  1.603618 3.472918 3.246293
H  5.192469 -2.914112 -0.923048
H  -2.820986 -2.700905 4.064051
H  1.688579 5.292032 1.517353
