program: Gaussian 09
title: 000286053
version: EM64L-G09RevD.01
frameworkgroup: C1[X(C24H28ClN3O2)]
method: RPBEPBE
basis: SDD
operation: Freq
keyword: #p
keyword: freq=noraman
keyword: PBEPBE/SDD
title: #p freq=noraman PBEPBE/SDD
converged: NO YES NO NO
title: Mulliken charges:
elementType: Cl O O N N N C C C C C C C C C C C C C C C C C C C C C C C C H H H H H H H H H H H H H H H H H H H H H H H H H H H H
charge: -0.088413 -0.250911 -0.515163 -0.140648 0.037306 -0.432281 0.510189 -0.498175 -0.500466 -0.489431 -0.494645 -0.412112 -0.417524 -0.462247 -0.489432 -0.386421 0.511277 -0.361871 -0.392600 -0.335047 -0.391473 0.552802 -0.396000 0.177489 0.090037 0.256960 -0.310582 -0.388223 -0.245993 -0.200610 0.206376 0.195434 0.199959 0.201517 0.222409 0.210367 0.204109 0.227207 0.206427 0.198174 0.199337 0.198481 0.225932 0.216904 0.221744 0.238466 0.187301 0.206489 0.246999 0.219972 0.287291 0.226876 0.370904 0.283647 0.216784 0.234789 0.232376 0.377940
chargesum: 0.00000
title: Mulliken charges with hydrogens summed into heavy atoms:
elementType: Cl O O N N N C C C C C C C C C C C C C C C C C C C C C C C C
charge: -0.088413 -0.250911 -0.137224 -0.140648 0.037306 -0.061377 0.510189 -0.096365 -0.098990 -0.056655 -0.063328 -0.007512 -0.019706 -0.019411 -0.029222 0.007368 0.511277 -0.114872 -0.172628 -0.335047 -0.104182 0.552802 -0.169124 0.177489 0.090037 0.256960 -0.026936 -0.171438 -0.011203 0.031766
polarizability: 6.68331096e+02 2.57265814e+01 2.91077987e+02 -3.29940017e+01 1.99488272e+01 1.74762902e+02
1716.lowfreq: -6.9611 -0.9123 -0.0023 0.0008 0.0019 3.0151 13.1912 16.8148 21.5051
frequency: 12.0705 16.7426 21.4811 27.2299 31.0529 53.9227 64.9293 95.8152 99.1559 108.7211 132.7122 141.7857 153.6179 170.0150 187.6535 208.3881 227.1271 236.7766 254.5624 266.3949 270.6132 280.4231 324.9570 325.5764 337.6505 351.6158 362.2183 375.0387 379.4512 396.9517 399.4538 427.9921 435.4781 441.4325 447.0555 460.6265 465.1898 474.6939 500.2673 520.8817 525.6979 534.2284 542.1430 581.2976 586.0338 603.8904 653.0558 664.2269 666.3371 671.1018 717.0181 741.9975 748.9174 765.4232 775.8911 787.4881 793.6714 796.1271 814.9404 818.4862 828.8620 838.1972 842.1770 856.9177 876.5203 900.7382 902.0477 920.5291 925.0658 934.9593 941.3943 957.5168 981.8493 985.5994 1001.5060 1002.5476 1004.1821 1010.6765 1017.8523 1029.9351 1031.4444 1052.5554 1057.2180 1071.7486 1088.7077 1097.4340 1107.7204 1129.1722 1133.1849 1140.1913 1151.7064 1154.0851 1171.2250 1172.2594 1187.8285 1195.9371 1210.4176 1235.5211 1241.1714 1245.7372 1249.4088 1252.6666 1264.5866 1274.1296 1289.6852 1291.1351 1303.7270 1317.6152 1323.6531 1333.4454 1335.2375 1335.8978 1338.3573 1341.9303 1352.2776 1354.5731 1355.7484 1361.7885 1390.5048 1403.3109 1433.0309 1441.3405 1448.0770 1453.4670 1458.6466 1463.7007 1470.0725 1471.9856 1477.2791 1478.8868 1482.5320 1497.0696 1510.8898 1521.9009 1542.1615 1571.2705 1580.3104 1611.7886 1623.3898 1629.4349 2949.7836 2958.2627 2964.1367 2966.3343 2973.1084 2974.1329 2974.5407 2979.7118 2984.1806 3010.1179 3012.5347 3018.5211 3026.3929 3028.2549 3030.2568 3040.6576 3046.8968 3087.4073 3101.4062 3111.4072 3142.0435 3146.4940 3154.3093 3167.0025 3171.6499 3186.9313 3299.7287 3594.6412
redmass: 5.1625 5.1691 6.8698 5.5286 5.2376 5.9393 4.2528 4.5828 5.9459 4.2467 4.7553 3.8714 9.0239 4.9060 3.8914 2.6527 3.6805 4.0699 4.2384 2.4416 3.5990 3.7546 1.2647 2.2065 2.3689 8.0729 7.3132 4.0608 4.0160 2.7286 2.0392 2.7408 3.0947 5.1115 2.6716 3.5841 2.7797 3.2058 3.7966 4.3761 3.7899 2.8961 3.3762 3.3390 3.2118 3.0884 6.1056 6.3849 4.3591 3.0247 2.9360 5.4487 3.0084 1.5611 1.4746 1.1404 3.7768 1.9538 2.0471 1.5226 1.7790 4.6357 1.9247 1.4309 2.4288 5.0309 2.7057 1.5939 1.7053 2.8170 1.5055 1.3494 2.2961 1.3679 2.0087 1.3306 1.7014 2.5829 2.3082 3.4362 2.0460 3.1698 1.8847 2.6065 1.5146 1.6983 1.9035 2.5572 1.9500 2.2558 1.2747 1.4767 1.0651 1.5816 1.6341 1.5450 2.9623 1.4092 1.4824 1.8437 1.6417 1.8394 1.2903 1.3498 1.4673 1.4920 1.5228 1.4525 1.3641 1.4844 1.4399 1.7370 1.4885 1.4924 1.9198 1.6878 1.5332 1.3383 7.4736 2.4970 2.4963 4.9751 1.0945 1.0872 1.0885 1.0900 1.0857 1.0870 2.1099 1.1736 1.0915 1.1169 3.3961 6.0078 2.1980 4.6482 5.6895 6.2605 5.7793 5.6117 1.0605 1.0616 1.0629 1.0603 1.0635 1.0636 1.0711 1.0707 1.0618 1.0976 1.0873 1.0963 1.0962 1.1006 1.1010 1.1027 1.1001 1.0924 1.0922 1.0891 1.0878 1.0874 1.0930 1.0957 1.1003 1.0902 1.0798 1.0662
irintensity: 1.6282 0.4113 3.8848 2.1059 1.1901 1.8317 1.0789 1.8375 1.4098 0.3026 0.0714 0.7727 0.1171 0.5578 2.9455 1.3358 0.8551 0.5688 29.4328 4.9154 11.8478 13.8746 119.0633 17.3755 3.1925 8.2583 0.1960 5.2150 8.9100 6.1322 0.4260 0.1904 10.1983 7.4420 5.1184 3.3331 1.2334 3.1931 1.5052 0.8051 11.5182 0.4190 7.1017 2.1753 9.6731 1.8997 11.6272 8.1785 17.7226 0.3952 2.9633 26.4711 23.8562 52.4357 0.6712 110.4507 10.8171 7.0119 2.5814 1.0730 48.3275 5.6947 10.1121 0.1751 6.9238 36.9815 27.0378 5.9535 2.0819 82.6061 36.2600 2.8331 34.1561 4.3766 22.7041 1.4373 8.5855 32.6444 9.2425 2.6137 16.4215 70.6185 2.6798 60.5404 12.5364 19.8085 5.0286 77.4006 58.6944 38.1308 23.3423 37.2009 15.4450 8.9935 36.2848 5.4247 33.3254 133.7884 115.5915 2.6934 9.2596 154.1142 2.8921 8.5367 31.8835 75.3369 9.9018 4.5461 3.4962 7.9997 2.6406 37.6844 8.8196 0.8287 68.5357 4.4258 0.4212 15.9968 7.6533 86.6515 25.8354 40.5198 4.6360 2.5139 12.4146 11.7337 16.0118 26.1110 117.1026 6.1976 7.9752 54.4367 459.9380 44.8224 183.7400 247.1785 8.4461 17.3063 542.4670 416.3817 21.2998 25.3974 39.0109 56.1882 29.7642 25.1289 50.9998 53.1072 25.1915 43.6499 42.8271 60.3691 70.5288 104.5309 24.2649 133.1953 79.9018 20.8153 14.2539 11.4404 8.6590 5.6449 3.6950 15.9681 37.6111 10.2413 142.0699 40.1555
temp: 298.150 k
press: 1.00000 atm
elementType: 17 8 8 7 7 7 6 6 6 6 6 6 6 6 6 6 6 6 6 6 6 6 6 6 6 6 6 6 6 6 1 1 1 1 1 1 1 1 1 1 1 1 1 1 1 1 1 1 1 1 1 1 1 1 1 1 1 1
symmnumber: 1
zpe: 1247990.9 jmol-1
zpe.correction: 0.475335 hartree
zpe.thermalcorrener: 0.502648 hartree
zpe.thermalcorrenthalpy: 0.503592 hartree
zpe.thermalcorrgfe: 0.414707 hartree
zpe.sumelectzpe: -1703.899781 hartree
zpe.sumelectthermal: -1703.872467 hartree
zpe.sumelectthermalent: -1703.871523 hartree
zpe.sumelectthermalfe: -1703.960408 hartree
dipole: 2.5608 3.6100 1.2166
dipole: 4.5902
quadrupole: -111.8853 -183.3202 -189.7250
quadrupole: -27.7610 -13.0441 2.3147
quadrupole: 49.7582 -21.6767 -28.0815 -27.7610 -13.0441 2.3147
hfenergy: -1704.3751155 hartree
pointgroup: C01 [X(C24H28Cl1N3O2)]
dipole: -1.0364546 1.2577713 0.7779171 debye
polarizability: 662.6267554|28.8925599|248.1197089|-61.354296|56.9074879|223.4255205 unknown
InChI: InChI=1S/C24H28ClN3O2/c25-21-16-19(28-14-12-24(13-15-28)10-4-1-5-11-24)9-8-18(21)17-26-27-23(30)20-6-2-3-7-22(20)29/h2-3,6-9,16-17,27,29H,1,4-5,10-15H2
charge 0 multiplicity 1
58 atoms
Cl 0.249607 2.399509 2.447351
O  4.76435 -1.646481 -1.547718
O  6.07769 1.768322 0.682434
N  -3.557616 -0.945968 1.170323
N  2.822026 -0.288977 -0.057125
N  4.149705 0.098937 -0.101306
C  -6.201383 0.007867 0.119441
C  -6.868448 1.081551 -0.794076
C  -7.329409 -0.862687 0.76213
C  -5.202635 -0.859997 -0.709282
C  -5.392493 0.745391 1.232675
C  -7.843778 0.491223 -1.839703
C  -8.319395 -1.45956 -0.268168
C  -4.283484 -1.754212 0.16526
C  -4.496975 -0.217277 2.048673
C  -8.941674 -0.358954 -1.158623
C  -2.213477 -0.580823 1.028128
C  -1.67823 0.575184 1.6822
C  -1.296685 -1.367213 0.248663
C  -0.318121 0.886011 1.561633
C  0.051322 -1.018426 0.143785
C  0.604974 0.125678 0.8007
C  2.020825 0.457729 0.684383
C  5.069009 -0.626457 -0.864904
C  6.49428 -0.10862 -0.827663
C  6.985191 1.015026 -0.10395
C  7.433119 -0.838014 -1.604662
C  8.347305 1.388832 -0.155738
C  8.792763 -0.478626 -1.666918
C  9.253197 0.642352 -0.937218
H  -6.078261 1.672489 -1.300394
H  -7.42821 1.790401 -0.146721
H  -7.899699 -0.219306 1.464981
H  -6.898764 -1.681263 1.371522
H  -4.5601 -0.185998 -1.310529
H  -5.744169 -1.508075 -1.423458
H  -6.093104 1.269017 1.91404
H  -4.750252 1.519349 0.765251
H  -7.287384 -0.136132 -2.564979
H  -8.303373 1.312174 -2.423455
H  -9.115712 -2.01344 0.266276
H  -7.802026 -2.201567 -0.909616
H  -4.886465 -2.518955 0.695445
H  -3.575452 -2.293699 -0.480165
H  -3.94833 0.314963 2.84045
H  -5.13068 -0.96981 2.559685
H  -9.573379 0.302088 -0.529059
H  -9.607764 -0.810579 -1.918946
H  -2.314575 1.245265 2.262424
H  -1.637214 -2.276465 -0.25377
H  0.741896 -1.632009 -0.444173
H  2.3748 1.346693 1.238409
H  4.498519 0.921667 0.423601
H  7.039981 -1.699667 -2.154703
H  8.698785 2.260239 0.412759
H  9.48824 -1.064107 -2.27625
H  10.307581 0.9364 -0.973435
H  6.529748 2.515906 1.143485
