program: Gaussian 09
title: 000286011
version: EM64L-G09RevD.01
frameworkgroup: C1[X(C7H9N5)]
method: RPBEPBE
basis: SDD
operation: Freq
keyword: #p
keyword: freq=noraman
keyword: PBEPBE/SDD
title: #p freq=noraman PBEPBE/SDD
converged: NO YES NO NO
title: Mulliken charges:
elementType: N N N N N C C C C C C C H H H H H H H H H
charge: -0.150504 -0.102372 -0.023829 -0.064085 -0.614732 0.330036 -0.095877 -0.057490 -0.767192 0.154761 -0.606559 -0.396469 0.230703 0.284126 0.230713 0.237564 0.264121 0.237535 0.238349 0.331117 0.340083
chargesum: 0.00000
title: Mulliken charges with hydrogens summed into heavy atoms:
elementType: N N N N N C C C C C C C
charge: -0.150504 -0.102372 -0.023829 -0.064085 0.056468 0.330036 -0.095877 -0.057490 -0.021650 0.154761 0.132661 -0.158120
polarizability: 1.56060167e+02 3.69491968e+00 1.25424722e+02 1.08910826e-02 -5.67955970e-03 5.46370751e+01
1716.lowfreq: -8.1079 0.0006 0.0006 0.0009 3.0174 5.6032 28.1646 106.0981 130.2188
frequency: 26.9926 106.0869 130.1871 135.6406 196.4249 211.0619 243.1063 297.7130 324.4526 338.0788 477.4287 488.3435 542.8316 545.4546 572.9372 579.9069 599.5967 623.0267 669.5295 710.3074 804.0167 823.1537 865.8122 929.8656 966.3696 994.4562 1025.4754 1041.5306 1120.3235 1121.8488 1203.5802 1220.0108 1274.4784 1326.5816 1341.2443 1365.6391 1395.0448 1400.8012 1430.8839 1442.4667 1466.3274 1466.5678 1476.3994 1481.2611 1493.8924 1552.4906 1591.5244 1619.9664 2969.8581 2999.2728 3041.3091 3084.2501 3099.9246 3139.4400 3158.3790 3535.0395 3692.7038
redmass: 1.0672 2.9646 1.5294 1.8206 3.3334 5.2251 2.5874 4.5960 5.0178 3.1512 7.2636 1.1839 5.0727 1.1811 4.0988 4.0520 5.6830 5.1194 7.9340 6.4978 10.9959 4.5469 5.6321 1.4183 2.1789 2.6763 2.1030 1.4479 1.3285 3.4763 3.3240 2.8612 5.3155 5.0850 8.0486 1.8159 2.3574 1.5219 1.7285 1.6540 1.0440 1.2388 1.0433 1.2660 4.1146 2.8128 5.9045 1.9115 1.0382 1.0351 1.0980 1.1019 1.0968 1.0996 1.0916 1.0442 1.1055
irintensity: 0.0629 4.5288 1.3490 4.1229 8.8831 1.6446 0.9040 0.1446 1.4675 3.1703 3.7040 244.2842 3.5308 25.9615 10.4112 3.3055 6.6813 30.4867 6.7790 9.1701 3.3679 5.6262 4.2504 11.8059 19.4891 19.3907 4.1203 1.6204 0.6258 0.8215 22.0001 9.1490 17.3666 5.2204 25.9577 20.0416 42.8712 67.6626 12.2545 38.5921 0.1863 20.2347 38.9378 15.7008 18.8216 88.3005 44.8226 445.5158 38.0489 44.7190 19.8082 19.3576 3.2197 3.2416 24.8116 105.1042 43.7632
temp: 298.150 k
press: 1.00000 atm
elementType: 7 7 7 7 7 6 6 6 6 6 6 6 1 1 1 1 1 1 1 1 1
symmnumber: 1
zpe: 429347.5 jmol-1
zpe.correction: 0.163530 hartree
zpe.thermalcorrener: 0.174448 hartree
zpe.thermalcorrenthalpy: 0.175392 hartree
zpe.thermalcorrgfe: 0.126341 hartree
zpe.sumelectzpe: -545.028409 hartree
zpe.sumelectthermal: -545.017491 hartree
zpe.sumelectthermalent: -545.016547 hartree
zpe.sumelectthermalfe: -545.065598 hartree
dipole: 3.7346 -3.1516 0.0014
dipole: 4.8867
quadrupole: -56.5518 -68.0907 -72.2316
quadrupole: 5.9517 -0.0013 0.0015
quadrupole: 9.0729 -2.4660 -6.6069 5.9517 -0.0013 0.0015
hfenergy: -545.1919384 hartree
pointgroup: C01 [X(C7H9N5)]
dipole: 1.477644 1.2299763 -0.0005675 debye
dipolederiv: -0.5061393 -0.228577 0.0000216 -0.4151382 0.1457348 0.0001077 -0.0002584 -0.0000965 -0.0776788 -0.1588706 0.1144265 0.0000483 -0.0857776 -0.5892298 -0.0000283 -0.000064 -0.0000188 -0.2083965 -0.6531816 0.01776 -0.0001728 0.0925917 -0.5253701 0.0000795 0.0000004 -0.0001354 -0.2044259 -0.4820116 -0.2159651 0.0000779 0.3442505 -1.0913061 -0.000037 -0.000253 0.0000884 -0.2484816 -0.5291417 0.4981279 -0.0000492 0.7127827 -1.2079197 0.0000383 -0.0000479 0.0000475 -0.6957394 0.3678432 -0.3320549 -0.000104 0.1818198 0.1205039 0.0000031 0.0000481 0.0001033 -0.0462323 0.0876889 0.3572978 0.0000096 0.0600844 0.0779241 -0.0000786 -0.0000717 -0.0000878 0.0108772 -0.4393582 0.2736314 0.0000051 0.0834358 -0.0898928 0.0000323 0.0000981 0.0000397 0.0470623 -0.0413393 0.0788749 0.0000307 -0.0338209 -0.0342981 0.0000083 0.0000272 0.0000017 0.1200583 0.8785986 -0.4115327 0.0000322 -0.7333038 1.5460904 -0.0001076 -0.0000594 -0.0000303 0.2135262 0.4377878 0.1283924 -0.0000808 0.201285 0.1768769 -0.0000821 0.0001123 -0.0000211 0.1935222 0.6175035 -0.0939449 0.0001651 -0.238039 0.7989048 0.0000438 0.0008133 0.000354 -0.0762503 -0.041867 0.0490793 -0.0948159 0.0253728 0.0720389 -0.0532478 -0.1415246 0.0004584 -0.041297 0.1119162 -0.1097074 0.0000011 -0.0131947 -0.0182489 -0.000007 -0.0000023 0.0000094 0.1256125 -0.0417818 0.0490788 0.0948137 0.0253931 0.0720305 0.0532375 0.1415111 -0.0004732 -0.0413669 -0.0570446 -0.0422971 0.0651219 0.0121652 0.0809676 -0.0796377 0.1188337 -0.0320947 -0.0448043 0.1078456 0.0881252 0.0000759 -0.0303639 -0.0370523 -0.0001231 0.0000049 -0.0001244 0.1346516 -0.0570717 -0.0421644 -0.0651563 0.0124311 0.0808863 0.0798091 -0.1187687 0.0322969 -0.0445095 0.0071191 -0.1025491 -0.000035 -0.0889034 -0.0454356 -0.0000206 -0.000442 -0.0003202 0.1267174 0.2342875 -0.0586018 0.0000041 -0.0379058 0.1960169 0.0000068 -0.000012 0.0000181 0.3791815 0.1572169 -0.0173998 0.0000068 -0.0751646 0.2707782 0.0000035 0.0000552 -0.0000153 0.3779733 unknown
polarizability: 156.008867|-3.9014614|125.4760225|-0.0109292|-0.0056059|54.6370751 unknown
InChI: InChI=1S/C7H9N5/c1-4-5-6(11-12(4)2)7(8)10-3-9-5/h3H,8H2,1-2H3
charge 0 multiplicity 1
21 atoms
N  1.756806 0.78058 0.000123
N  0.583956 1.541402 0.000184
N  -0.631121 -1.910234 0.00027
N  -2.595128 -0.416202 0.000254
N  -2.430516 1.938218 0.000005
C  1.555054 -0.594026 -0.000037
C  0.147263 -0.760056 0.000183
C  -0.393982 0.572985 0.000171
C  2.647043 -1.617858 -0.000273
C  -1.826995 0.706268 0.000066
C  3.043946 1.47896 0.000002
C  -1.95618 -1.648216 0.000766
H  3.297103 -1.542299 0.892783
H  2.178846 -2.615591 -0.000235
H  3.296796 -1.542228 -0.893546
H  3.630057 1.218976 -0.898551
H  2.833146 2.557711 0.000767
H  3.630817 1.217832 0.89772
H  -2.628734 -2.511756 -0.000212
H  -3.447979 1.983989 -0.000015
H  -1.8655 2.784545 -0.000025
